program: Gaussian 09
title: 000220987
version: EM64L-G09RevD.01
frameworkgroup: C1[X(C14H14O2S)]
method: RPBEPBE
basis: SDD
operation: Freq
keyword: #p
keyword: freq=noraman
keyword: PBEPBE/SDD
title: #p freq=noraman PBEPBE/SDD
converged: YES YES NO NO
title: Mulliken charges:
elementType: S O O C C C C C C C C C C C C C C H H H H H H H H H H H H H H
charge: 0.839029 -0.542518 -0.539653 -0.203627 0.471985 -0.027356 -0.456787 0.465304 -0.386273 -0.354102 -0.834066 -0.233629 -0.274321 -0.802469 -0.208261 -0.222311 -0.217581 0.306488 0.238247 0.235463 0.247154 0.283749 0.226210 0.274745 0.294205 0.234938 0.230245 0.236553 0.240172 0.241524 0.236943
chargesum: 0.00000
title: Mulliken charges with hydrogens summed into heavy atoms:
elementType: S O O C C C C C C C C C C C C C C
charge: 0.839029 -0.542518 -0.539653 -0.203627 0.471985 -0.027356 -0.150299 0.465304 -0.148025 -0.118640 -0.076954 0.041115 0.019884 -0.100733 0.031911 0.019213 0.019362
polarizability: 2.24694214e+02 -1.68645979e+01 1.75505309e+02 2.69980923e+00 7.23943396e-01 1.32716736e+02
1716.lowfreq: -11.0718 -9.3046 0.0013 0.0022 0.0023 6.9760 28.0015 37.3619 40.3779
frequency: 27.8144 37.1918 40.2064 53.9395 121.8302 133.1603 146.5464 156.1179 167.4558 199.8813 230.0501 240.5187 255.8552 306.2687 311.9796 341.7963 385.6065 403.1313 425.9645 444.0801 453.9296 472.5276 511.6280 560.0152 603.2175 654.0828 664.3994 693.0847 712.5451 732.5934 761.9738 782.6223 830.4708 844.9485 853.0533 910.7443 922.2037 936.4435 970.9013 975.9956 979.9196 984.7656 1005.3901 1008.9078 1012.1526 1019.9827 1048.6198 1049.8854 1055.0386 1077.0993 1153.2203 1173.0895 1178.0385 1211.3147 1224.4179 1274.6983 1302.3736 1350.9917 1383.2737 1399.3314 1400.0099 1405.9731 1434.9200 1453.5517 1465.2567 1469.7186 1472.1066 1485.7901 1490.6697 1560.8657 1578.4052 1603.6021 1622.8442 2981.0139 2981.4697 3059.2575 3064.5814 3093.2961 3099.3429 3120.1647 3132.1070 3135.0458 3144.0559 3144.6513 3153.3310 3162.3500 3172.7586
redmass: 3.3978 4.2381 1.1383 3.9706 3.5782 1.8292 2.4435 3.5693 3.3904 4.8527 6.3232 7.3558 6.4754 3.2014 3.4402 5.8443 8.0770 2.8477 4.5128 3.4500 4.4159 4.0253 4.8631 3.8693 6.4776 7.1411 7.2456 2.3272 3.1899 4.4026 1.5089 10.6907 1.2679 6.1545 1.2463 7.8643 1.4076 1.3723 1.3583 1.6906 4.4452 1.3885 1.3502 4.0335 1.6943 1.9625 2.1030 1.5813 1.5228 1.5547 1.3141 1.0588 1.1233 1.6312 6.6683 1.4306 1.3033 3.6867 8.3115 1.8044 1.9558 1.2120 2.2288 2.0220 1.0730 1.1052 1.0459 1.1037 2.9715 4.7582 5.7999 6.8866 7.1916 1.0376 1.0387 1.0976 1.0946 1.0988 1.1003 1.0874 1.0912 1.0856 1.0969 1.0882 1.0924 1.0967 1.1015
irintensity: 0.3241 0.7181 0.1510 0.8752 2.2777 0.8856 2.0817 2.4953 0.2664 1.6391 7.0721 5.5339 2.4573 1.3777 0.1286 1.8203 15.5192 0.0216 32.3166 2.6501 3.6036 59.2517 113.2740 3.6325 0.0199 2.4520 6.9563 35.9342 5.0412 2.9158 81.9390 54.3134 25.4740 2.9274 0.7169 73.3885 6.1342 1.7225 0.1527 5.4658 0.7720 0.1928 0.3152 1.2179 0.5901 3.0607 27.2162 1.0319 21.5463 5.0857 15.0000 0.2921 6.5472 10.3294 1.2208 4.9951 4.2071 5.9982 3.8933 9.9607 2.0246 15.3215 16.2976 16.1698 10.2295 5.7526 15.3130 41.4753 50.0391 4.6338 4.0963 0.2929 6.7923 30.7393 18.4250 17.6407 18.8131 14.9116 9.9859 9.2526 6.5317 0.9324 30.2833 8.8223 1.7022 7.5534 28.4819
temp: 298.150 k
press: 1.00000 atm
elementType: 16 8 8 6 6 6 6 6 6 6 6 6 6 6 6 6 6 1 1 1 1 1 1 1 1 1 1 1 1 1 1
symmnumber: 1
zpe: 628377.0 jmol-1
zpe.correction: 0.239336 hartree
zpe.thermalcorrener: 0.256077 hartree
zpe.thermalcorrenthalpy: 0.257021 hartree
zpe.thermalcorrgfe: 0.193677 hartree
zpe.sumelectzpe: -1089.017845 hartree
zpe.sumelectthermal: -1089.001104 hartree
zpe.sumelectthermalent: -1089.000160 hartree
zpe.sumelectthermalfe: -1089.063504 hartree
dipole: 0.4314 0.4022 -6.4660
dipole: 6.4929
quadrupole: -84.9201 -101.5792 -121.0622
quadrupole: -2.2218 4.2293 1.2767
quadrupole: 17.6004 0.9413 -18.5417 -2.2218 4.2293 1.2767
hfenergy: -1089.2571807 hartree
pointgroup: C01 [X(C14H14O2S1)]
dipole: -0.1496365 -0.5650567 2.4867166 debye
polarizability: 219.8852648|21.1106325|177.1925256|7.5125047|11.9328793|135.8384682 unknown
InChI: InChI=1S/C14H14O2S/c1-11-8-9-12(2)14(10-11)17(15,16)13-6-4-3-5-7-13/h3-10H,1-2H3
charge 0 multiplicity 1
31 atoms
S  0.360647 0.344051 -1.433247
O  0.506903 1.889725 -1.958638
O  0.291887 -0.904736 -2.493311
C  -1.198645 0.165334 -0.328812
C  -1.534944 1.134848 0.642959
C  1.847507 0.012645 -0.295526
C  -1.973006 -0.967055 -0.628966
C  -3.175286 -1.197965 0.082594
C  -2.745948 0.880103 1.343271
C  -3.542261 -0.252661 1.07535
C  -0.698547 2.360549 0.95754
C  2.141685 -1.318247 0.042463
C  2.634569 1.109666 0.086366
C  -4.046385 -2.404885 -0.215285
C  3.281056 -1.55417 0.84645
C  3.774559 0.853745 0.884255
C  4.090246 -0.471277 1.267251
H  -1.636636 -1.643063 -1.424185
H  -3.062154 1.595863 2.111242
H  -4.469856 -0.402152 1.64149
H  0.233764 2.081805 1.48532
H  -0.406832 2.890416 0.034521
H  -1.256921 3.052041 1.609801
H  1.520599 -2.14043 -0.32775
H  2.375897 2.116192 -0.259971
H  -3.585185 -3.059021 -0.973723
H  -4.22036 -3.008867 0.694643
H  -5.038094 -2.096158 -0.595929
H  3.540627 -2.579025 1.131779
H  4.415492 1.684807 1.196804
H  4.975425 -0.662577 1.883641
