program: Gaussian 09
title: 000220993
version: EM64L-G09RevD.01
frameworkgroup: C1[X(C17H12Br2O3)]
method: RPBEPBE
basis: SDD
operation: Freq
keyword: #p
keyword: freq=noraman
keyword: PBEPBE/SDD
title: #p freq=noraman PBEPBE/SDD
converged: YES YES NO NO
title: Mulliken charges:
elementType: Br Br O O O C C C C C C C C C C C C C C C C C H H H H H H H H H H H H
charge: 0.017896 0.017897 -0.408004 -0.408008 -0.249121 0.331037 0.331066 0.110723 0.110719 -0.291138 -0.291141 -0.253853 -0.253844 -0.334771 -0.334766 -0.252957 -0.252961 -0.376709 -0.376678 -0.159462 -0.159460 0.154550 0.263243 0.263241 0.274050 0.274047 0.263309 0.263311 0.240275 0.240234 0.257728 0.257729 0.365909 0.365907
chargesum: 0.00000
title: Mulliken charges with hydrogens summed into heavy atoms:
elementType: Br Br O O O C C C C C C C C C C C C C C C C C
charge: 0.017896 0.017897 -0.042094 -0.042101 -0.249121 0.331037 0.331066 0.110723 0.110719 -0.027895 -0.027900 0.020196 0.020204 -0.071462 -0.071455 -0.252957 -0.252961 -0.136433 -0.136444 0.098266 0.098269 0.154550
polarizability: 5.80921085e+02 1.65258870e-02 2.30857150e+02 -6.63274868e-03 -2.24073280e+01 1.03496501e+02
1716.lowfreq: -4.4841 -1.5105 -0.0007 -0.0005 0.0002 2.5513 14.1633 14.3831 25.9263
frequency: 14.1439 14.2991 25.9261 61.9234 75.9801 77.2762 96.4822 109.3906 114.2760 134.4135 181.9916 192.0928 232.9666 244.7090 247.4037 261.8471 266.8853 266.8895 297.3344 328.6485 329.4872 357.9148 392.4798 435.5518 445.9968 457.9754 481.0150 484.0112 515.7725 551.1173 553.1065 582.0251 612.2762 614.6322 622.1476 682.6101 716.3542 726.2755 736.7228 758.4881 772.4178 827.3861 827.7116 854.5451 874.6605 881.1126 884.7417 902.5413 908.5124 956.5160 956.9731 969.5034 994.7828 1008.0915 1067.9331 1070.4468 1098.1230 1110.1494 1120.4789 1148.9527 1153.9461 1208.9612 1212.1763 1224.5483 1224.8389 1280.7959 1293.5859 1303.0048 1303.8687 1316.8361 1320.0339 1382.0731 1383.4852 1401.3118 1410.7147 1465.7407 1466.2022 1517.5002 1551.3722 1556.5139 1602.7901 1610.0269 1611.3496 1631.4814 3088.7181 3089.7575 3099.8411 3106.9356 3158.0859 3158.1216 3165.2165 3165.2432 3184.4801 3184.5052 3504.4016 3504.8901
redmass: 8.9566 13.1447 8.1551 8.3883 8.8661 5.0965 6.3031 7.2987 9.7431 4.4893 7.0023 5.9197 5.7669 2.6709 4.9671 6.1940 13.8986 6.2017 6.7807 4.9039 4.6851 5.2669 4.2835 4.2100 2.3237 2.6233 1.2815 1.4319 3.4597 3.4621 3.7362 6.5757 7.6419 7.1596 6.4021 4.1315 5.9493 4.0425 4.0900 5.2141 4.4284 1.4428 1.4572 1.8913 3.9601 2.1220 1.8528 2.0154 2.2013 1.3796 1.3501 3.4828 1.1760 1.1885 2.5004 2.2526 1.9545 1.6424 1.7491 1.4496 1.4028 2.1833 2.7385 1.4443 1.6234 1.6809 1.5563 1.2855 1.4333 1.4356 2.8084 5.8545 6.1315 3.6906 3.8613 2.8469 2.8374 10.0890 6.3964 6.4661 5.3878 6.5633 6.7916 5.5858 1.0908 1.0905 1.0893 1.0895 1.0926 1.0926 1.0887 1.0888 1.0976 1.0976 1.0654 1.0654
irintensity: 0.0169 0.1062 0.2934 0.0046 4.4188 0.4002 0.4000 0.0131 1.9498 1.2127 0.9027 0.3625 11.9141 30.3545 0.1338 6.3989 4.6259 2.8249 5.2596 1.4435 1.4496 0.2342 4.7608 91.1108 17.2008 1.2816 19.2899 186.9781 49.6620 1.8184 3.4472 59.0062 19.0428 23.2385 2.8176 15.4178 0.0607 7.2086 3.1262 10.3140 4.6201 1.9767 78.0965 14.8975 14.2042 18.5129 28.5321 4.3464 0.0134 0.8023 0.0638 5.0065 56.3836 69.8615 112.4914 4.5308 220.0659 9.6626 296.6942 25.8446 287.0639 101.5623 61.8732 2.9464 111.6831 1.0672 62.8107 47.1416 19.9158 0.1679 62.3261 5.1854 0.0070 8.7904 85.0479 13.3219 176.5264 105.6469 368.2472 3.4993 879.7070 6.0790 86.7595 2.0301 1.5259 0.3342 7.4839 13.2662 0.1117 1.3272 0.2669 0.5111 4.0881 3.8055 64.8708 6.4996
temp: 298.150 k
press: 1.00000 atm
elementType: 35 35 8 8 8 6 6 6 6 6 6 6 6 6 6 6 6 6 6 6 6 6 1 1 1 1 1 1 1 1 1 1 1 1
symmnumber: 1
zpe: 630311.0 jmol-1
zpe.correction: 0.240073 hartree
zpe.thermalcorrener: 0.260887 hartree
zpe.thermalcorrenthalpy: 0.261831 hartree
zpe.thermalcorrgfe: 0.185841 hartree
zpe.sumelectzpe: -906.026404 hartree
zpe.sumelectthermal: -906.005590 hartree
zpe.sumelectthermalent: -906.004646 hartree
zpe.sumelectthermalfe: -906.080636 hartree
dipole: 0.0001 2.7265 -0.5211
dipole: 2.7758
quadrupole: -148.6524 -146.7535 -152.7518
quadrupole: 0.0001 -0.0013 0.8084
quadrupole: 0.7335 2.6324 -3.3659 0.0001 -0.0013 0.8084
hfenergy: -906.2664768 hartree
pointgroup: C01 [X(C17H12Br2O3)]
dipole: 0.001613 0.7772801 0.7671358 debye
polarizability: 580.9180934|0.3246147|170.7179059|-1.1075699|67.4140162|163.6387371 unknown
InChI: InChI=1S/C17H12Br2O3/c18-13-3-7-16(21)11(9-13)1-5-15(20)6-2-12-10-14(19)4-8-17(12)22/h1-10,21-22H
charge 0 multiplicity 1
34 atoms
Br 7.538372 -1.987602 -0.886746
Br -7.54186 -1.993447 -0.848381
O  3.267481 1.92018 1.239255
O  -3.263216 1.917331 1.256384
O  -0.005682 -0.514094 -2.177631
C  3.821294 0.007174 -0.252543
C  -3.823143 0.004154 -0.232931
C  4.167965 0.966231 0.755968
C  -4.165387 0.962743 0.777531
C  4.858147 -0.840282 -0.749278
C  -4.861867 -0.844037 -0.724487
C  2.476218 -0.146647 -0.808374
C  -2.48081 -0.148539 -0.795659
C  5.473876 1.013751 1.291477
C  -5.468556 1.009118 1.319781
C  6.148252 -0.783767 -0.204982
C  -6.149194 -0.788657 -0.173531
C  1.26412 0.154774 -0.229544
C  -1.265991 0.153829 -0.22306
C  6.467482 0.131011 0.826022
C  -6.463834 0.12567 0.859288
C  -0.00274 -0.101608 -0.96804
H  4.620677 -1.558126 -1.540744
H  -4.627898 -1.561517 -1.517327
H  2.408026 -0.598625 -1.810102
H  -2.41741 -0.600427 -1.79774
H  5.698619 1.757475 2.060722
H  -5.689921 1.75251 2.090326
H  1.174932 0.485682 0.814509
H  -1.171681 0.484836 0.820512
H  7.476513 0.167877 1.245719
H  -7.470715 0.161631 1.284194
H  2.46705 1.975433 0.653966
H  -2.465817 1.973363 0.667045
