program: Gaussian 09
title: 000002663
version: EM64L-G09RevD.01
frameworkgroup: C1[X(C20H33N3O4)]
method: RPBEPBE
basis: SDD
operation: Freq
keyword: #p
keyword: freq=noraman
keyword: PBEPBE/SDD
title: #p freq=noraman PBEPBE/SDD
converged: YES YES NO NO
title: Mulliken charges:
elementType: O O O O N N N C C C C C C C C C C C C C C C C C C C C H H H H H H H H H H H H H H H H H H H H H H H H H H H H H H H H H
charge: -0.283284 -0.468216 -0.321288 -0.246985 -0.343794 -0.165079 -0.514498 0.273314 -0.433348 -0.113484 -0.727012 -0.686015 -0.696949 -0.313318 0.220844 0.241908 0.498395 -0.343426 -0.464792 -0.471716 -0.408132 -0.347611 0.283109 0.139599 -0.648482 -0.655542 -0.780204 0.238314 0.231009 0.234051 0.198065 0.228726 0.208221 0.201244 0.217094 0.222100 0.200775 0.231406 0.207007 0.203672 0.226892 0.225584 0.381621 0.248734 0.325735 0.219897 0.212383 0.236687 0.262261 0.205888 0.316152 0.217787 0.231311 0.221670 0.250230 0.201578 0.217837 0.249987 0.245416 0.256669
chargesum: 0.00000
title: Mulliken charges with hydrogens summed into heavy atoms:
elementType: O O O O N N N C C C C C C C C C C C C C C C C C C C C
charge: -0.283284 -0.086595 -0.321288 -0.246985 -0.105480 -0.165079 -0.198346 0.273314 0.031712 0.084582 -0.088821 -0.046046 -0.054864 0.139159 0.220844 0.241908 0.498395 -0.094691 -0.139057 -0.251819 0.040938 0.120539 0.283109 0.139599 0.022286 0.014103 -0.028132
polarizability: 3.84968977e+02 -5.54798993e+00 2.53592884e+02 1.89408084e+01 1.16776375e+01 1.86512930e+02
1716.lowfreq: -4.7484 -2.8381 -0.0010 -0.0007 0.0014 2.6732 11.6089 18.2648 20.7090
frequency: 11.4765 18.0151 20.5167 25.8567 38.8159 49.8150 58.7114 64.6216 71.0470 77.3441 88.0916 101.9118 112.3144 124.6023 130.4425 140.4157 147.4095 161.6067 175.4176 183.1556 201.6477 216.3492 223.7661 233.6275 244.5555 249.3640 257.7333 262.0092 298.9581 318.8829 325.0907 332.6017 341.1589 357.5014 367.3893 378.5444 381.4172 399.5159 414.9767 428.4628 438.0341 467.0285 481.7575 497.0947 520.9355 524.2195 538.9750 559.1014 588.6582 610.4978 623.5552 641.0824 665.4713 700.0346 706.7671 733.5322 740.9494 746.6407 769.3715 780.1424 783.8963 816.4079 824.4475 836.1262 884.3173 901.4715 910.0813 915.2363 922.6867 929.4562 937.2378 939.1744 942.7072 945.5113 955.6514 965.2860 1004.1779 1015.9399 1021.1685 1033.5909 1042.1317 1063.7170 1071.1957 1073.8019 1081.1319 1095.5181 1097.2176 1113.7176 1148.2992 1155.8646 1179.5381 1211.0162 1215.0909 1218.3844 1229.5059 1238.7065 1243.7958 1254.6225 1262.1123 1263.6180 1282.1134 1282.6562 1301.9812 1326.5741 1336.8287 1339.1741 1354.0315 1362.0132 1365.7063 1370.9911 1371.3838 1374.6228 1384.3554 1389.2887 1391.3095 1394.5590 1399.8863 1407.2888 1445.1445 1445.8392 1447.5267 1453.7764 1455.2410 1458.4386 1462.3564 1464.7430 1465.0930 1469.3185 1474.8386 1479.3475 1480.8375 1481.8738 1485.4505 1486.9477 1494.9761 1500.8538 1511.8913 1564.4617 1587.5420 1612.7368 1625.8687 2935.0641 2966.0989 2969.9933 2975.1081 2982.0144 2982.8315 2984.0754 2990.3513 2990.7708 2996.1536 3006.9084 3039.5563 3058.8988 3063.5215 3066.2277 3067.2400 3071.4982 3073.6588 3078.0631 3078.5882 3081.3227 3085.2924 3086.7513 3089.7441 3090.9881 3101.6474 3109.4330 3127.0882 3159.1595 3194.1827 3268.6706 3409.0632 3555.0873
redmass: 4.4673 4.0324 3.6351 3.9276 2.8347 3.3015 4.8207 3.0093 3.7766 4.5458 3.9010 4.0388 3.2600 3.7980 3.5409 3.6563 1.1908 2.1770 1.5742 2.4987 1.2524 2.4053 2.8645 1.5489 1.2863 3.1643 1.5163 1.2344 3.1901 2.9435 4.1095 2.3869 3.3030 4.2956 2.5032 4.0992 6.1543 2.6174 2.8545 3.5344 2.2469 2.6476 3.4052 2.9881 2.7740 3.4455 1.4553 3.2495 3.9446 3.6217 2.9743 3.7986 1.6979 9.1010 5.6116 2.1733 3.1113 1.4025 1.5986 1.2708 2.4701 1.6483 2.3770 2.7370 2.0230 1.8499 3.0505 2.9811 1.6207 1.5156 1.2065 2.2570 1.7426 2.3578 2.5278 2.4828 1.6605 1.4083 1.7946 1.6942 2.7517 2.1973 2.4420 2.0291 1.8658 1.6990 3.5740 1.9358 1.4211 2.2651 1.2626 2.4769 2.5222 1.9610 1.5260 2.5958 1.9580 1.9468 2.2515 1.7203 1.6374 1.7136 1.4473 1.4086 1.3067 1.3211 1.3325 1.3285 1.2092 1.2677 1.3412 2.5056 1.2291 1.2924 1.2168 2.4745 1.2234 3.9767 1.1761 1.1441 1.1056 1.0819 1.0882 1.0551 1.0490 1.0463 1.0500 1.0450 1.0622 1.5273 1.1301 1.2126 1.0949 1.1173 1.0775 1.3580 1.8151 5.3921 7.8193 3.9132 6.4463 1.0692 1.0355 1.0362 1.0653 1.0364 1.0354 1.0365 1.0600 1.0383 1.0665 1.0788 1.0967 1.0988 1.0948 1.0951 1.0982 1.0993 1.1097 1.0950 1.0986 1.0999 1.1000 1.0971 1.1004 1.0996 1.1018 1.0898 1.1008 1.0941 1.0916 1.0694 1.0736 1.0754
irintensity: 0.4223 0.4307 0.2061 0.2609 0.2797 0.7052 0.9946 1.4795 2.3893 10.1216 1.3308 4.8856 0.0963 0.5128 0.5313 2.4388 0.5098 1.7287 2.2782 2.9208 0.9005 1.1633 6.9364 6.2281 2.8051 0.3759 1.4220 0.4790 3.5925 2.1846 1.7654 3.4246 4.2676 7.3454 6.5893 6.2152 10.2725 2.5073 0.8588 7.4613 4.5489 0.2262 18.0995 21.1145 19.9104 2.6827 40.0372 25.0278 6.5274 1.5846 5.2067 19.6677 46.3608 14.5500 12.8137 48.6372 6.2973 165.0272 26.9656 4.0701 1.3365 51.5406 9.6925 2.0625 5.6529 16.6159 36.3949 20.8591 10.0533 17.4429 0.0598 3.8263 33.3541 32.1142 38.5859 8.8785 3.9307 1.7041 2.6830 22.5040 15.9589 8.3845 47.5995 15.1257 22.3189 25.8683 38.8360 17.1561 19.6628 164.4701 34.8618 111.9238 87.9091 56.6298 18.8993 39.0179 334.3043 87.1297 29.2146 39.4412 45.7435 47.4959 64.8806 21.1682 21.2157 6.8017 8.5388 39.8822 29.3274 9.9318 67.9982 26.5156 19.0091 38.2446 25.8052 128.2510 34.1296 239.8088 70.4756 6.2245 99.7350 3.2748 24.0309 20.3983 0.5043 2.6657 1.2499 9.2781 11.3417 0.5736 10.5382 42.3511 4.7647 6.7497 43.6804 299.3172 325.9261 399.5945 96.7027 271.5591 1.1963 53.6366 30.7447 49.9438 34.2242 35.0147 13.7637 17.4038 10.0796 2.1883 48.8008 88.8005 13.2045 3.3368 2.9681 79.7390 17.7283 12.9401 31.5708 9.9124 58.7772 60.4380 17.8189 35.1458 28.3045 76.2996 31.4835 25.1801 15.6994 8.4611 14.8669 549.5882 3.4415 11.6871
temp: 298.150 k
press: 1.00000 atm
elementType: 8 8 8 8 7 7 7 6 6 6 6 6 6 6 6 6 6 6 6 6 6 6 6 6 6 6 6 1 1 1 1 1 1 1 1 1 1 1 1 1 1 1 1 1 1 1 1 1 1 1 1 1 1 1 1 1 1 1 1 1
symmnumber: 1
zpe: 1331667.8 jmol-1
zpe.correction: 0.507205 hartree
zpe.thermalcorrener: 0.538381 hartree
zpe.thermalcorrenthalpy: 0.539326 hartree
zpe.thermalcorrgfe: 0.441738 hartree
zpe.sumelectzpe: -1244.964463 hartree
zpe.sumelectthermal: -1244.933287 hartree
zpe.sumelectthermalent: -1244.932343 hartree
zpe.sumelectthermalfe: -1245.029931 hartree
dipole: 5.8677 -6.1115 2.2801
dipole: 8.7738
quadrupole: -122.3710 -158.5248 -173.4856
quadrupole: -7.5497 -6.8363 10.0891
quadrupole: 29.0895 -7.0643 -22.0252 -7.5497 -6.8363 10.0891
hfenergy: -1245.4716685 hartree
pointgroup: C01 [X(C20H33N3O4)]
dipole: -2.5397527 -0.8405483 2.1814091 debye
polarizability: 386.7391856|-0.2263435|183.3711511|4.7212195|7.2666534|254.9644536 unknown
InChI: InChI=1S/C20H33N3O4/c1-7-23(8-2)19(26)22-15-9-10-18(17(11-15)14(3)24)27-13-16(25)12-21-20(4,5)6/h9-11,16,21-22,25H,7-8,12-13H2,1-6H3
charge 0 multiplicity 1
60 atoms
O  1.921663 -0.027053 0.372476
O  3.560639 1.949662 -0.704022
O  -4.33444 -0.055223 -1.636561
O  1.632594 0.590194 -2.291327
N  5.489796 -0.704601 1.160354
N  -6.002783 -0.041285 -0.000465
N  -3.723946 0.132419 0.631678
C  5.930004 -2.133692 1.037416
C  4.853106 -0.056056 -0.010381
C  4.001425 1.160447 0.437163
C  6.679178 -2.472685 2.349491
C  4.682693 -3.04496 0.913075
C  6.87788 -2.364237 -0.177981
C  2.804802 0.72664 1.3017
C  0.544448 0.119394 0.445867
C  -0.200812 0.062867 -0.775868
C  -2.305895 0.132981 0.514038
C  -0.143083 0.225757 1.679824
C  -1.619961 0.039489 -0.720064
C  -1.547715 0.241453 1.712141
C  -6.454974 -0.073773 1.405881
C  -7.036786 -0.110116 -1.061154
C  -4.665534 0.008089 -0.407671
C  0.468251 0.111339 -2.118218
C  -6.590267 1.327058 2.051228
C  -7.455019 -1.557082 -1.397705
C  -0.30882 -0.387499 -3.33313
H  6.26727 -0.128819 1.517081
H  5.571948 0.311041 -0.775865
H  4.184048 -0.778627 -0.50887
H  4.632616 1.841322 1.042491
H  6.016385 -2.318416 3.219552
H  7.020883 -3.523205 2.345692
H  7.571377 -1.827548 2.473987
H  4.127694 -2.860818 -0.024137
H  3.995448 -2.861635 1.757749
H  4.98366 -4.108678 0.920797
H  6.378262 -2.094763 -1.126252
H  7.185695 -3.424668 -0.246905
H  7.79216 -1.74715 -0.084371
H  3.139301 0.060124 2.117566
H  2.263726 1.609825 1.689378
H  2.883818 1.423271 -1.232282
H  0.423871 0.26435 2.615191
H  -2.217831 -0.016468 -1.630501
H  -2.060903 0.318918 2.67986
H  -5.785869 -0.722031 2.00706
H  -7.439053 -0.576461 1.423055
H  -6.620801 0.372021 -1.960841
H  -7.910413 0.481564 -0.725828
H  -4.07432 0.260446 1.580912
H  -5.626013 1.866686 2.075889
H  -7.300177 1.948071 1.477149
H  -6.966194 1.243257 3.087564
H  -6.589235 -2.119125 -1.786786
H  -7.847097 -2.086307 -0.509143
H  -8.245647 -1.557874 -2.170566
H  -1.109772 0.326581 -3.603489
H  -0.791324 -1.3614 -3.140803
H  0.383644 -0.468311 -4.184719
