program: Gaussian 09
title: 000220967
version: EM64L-G09RevD.01
frameworkgroup: C1[X(C7H7BrO3S)]
method: RPBEPBE
basis: SDD
operation: Freq
keyword: #p
keyword: freq=noraman
keyword: PBEPBE/SDD
title: #p freq=noraman PBEPBE/SDD
converged: NO YES NO NO
title: Mulliken charges:
elementType: Br S O O O C C C C C C C H H H H H H H
charge: 0.052560 0.988622 -0.394226 -0.506732 -0.506764 -0.035369 -0.225496 -0.225332 -0.154208 -0.154239 -0.207596 -0.482720 0.290691 0.290653 0.266635 0.266635 0.244037 0.244031 0.248815
chargesum: 0.00000
title: Mulliken charges with hydrogens summed into heavy atoms:
elementType: Br S O O O C C C C C C C
charge: 0.052560 0.988622 -0.394226 -0.506732 -0.506764 -0.035369 0.065196 0.065322 0.112427 0.112396 -0.207596 0.254164
polarizability: 2.01887516e+02 -3.30571309e-03 1.10656947e+02 -1.18937792e-01 3.26108180e-02 7.55415143e+01
1716.lowfreq: -8.1407 -1.2603 -0.0019 -0.0015 -0.0010 12.0045 26.5865 47.6521 49.6222
frequency: 26.5378 47.6498 49.5889 110.4200 114.9836 121.0821 182.5345 206.5397 216.7397 272.4428 298.3774 341.0286 366.7441 371.4160 408.0305 469.7693 500.5838 536.1320 609.4735 687.9008 705.2273 829.4315 834.5454 838.2879 921.5363 957.9923 965.6156 978.4907 979.8679 1048.7188 1055.2959 1107.3394 1109.2686 1110.4257 1179.9961 1284.7964 1376.2867 1377.6777 1408.5163 1440.4133 1446.9712 1473.3954 1562.2181 1591.2453 2977.0698 3084.7614 3105.7904 3161.7347 3161.8699 3180.1304 3182.8569
redmass: 3.2450 6.2490 4.7244 6.9649 6.4512 1.1360 20.5787 5.0086 8.6005 6.6281 6.6889 11.1055 7.3667 7.0363 2.8804 5.0573 6.3081 7.1441 7.1005 6.7104 4.2844 6.2238 1.2413 1.6666 9.0208 16.8411 1.3256 7.5155 1.3841 7.4876 1.8087 1.3490 1.3465 1.2586 1.1256 1.2285 2.7823 11.6500 1.1207 1.0483 2.0763 1.0561 6.0871 8.1434 1.0280 1.1061 1.1028 1.0899 1.0897 1.0966 1.0978
irintensity: 3.6603 0.3431 1.3062 4.4779 4.0638 0.2729 1.0644 16.6850 0.8162 8.5727 2.6855 25.2868 10.3200 2.3351 0.0026 3.1914 52.6059 170.0888 0.4470 41.6488 8.9516 136.4337 0.2847 25.4421 83.7604 83.0226 0.2126 46.5877 0.1566 76.9652 1.2546 3.1420 12.7491 0.0011 7.3787 1.0295 21.9587 2.4621 0.6200 16.5599 51.2424 24.8655 46.1627 1.0792 41.6743 22.6444 10.4452 2.8184 2.9369 0.0670 3.2796
temp: 298.150 k
press: 1.00000 atm
elementType: 35 16 8 8 8 6 6 6 6 6 6 6 1 1 1 1 1 1 1
symmnumber: 1
zpe: 331220.5 jmol-1
zpe.correction: 0.126155 hartree
zpe.thermalcorrener: 0.139257 hartree
zpe.thermalcorrenthalpy: 0.140201 hartree
zpe.thermalcorrgfe: 0.083756 hartree
zpe.sumelectzpe: -907.052694 hartree
zpe.sumelectthermal: -907.039592 hartree
zpe.sumelectthermalent: -907.038647 hartree
zpe.sumelectthermalfe: -907.095093 hartree
dipole: -1.6846 -0.0040 2.3122
dipole: 2.8608
quadrupole: -87.0976 -83.6647 -91.8455
quadrupole: -0.0227 12.7463 0.0053
quadrupole: 0.4383 3.8712 -4.3095 -0.0227 12.7463 0.0053
hfenergy: -907.1788489 hartree
pointgroup: C01 [X(C7H7Br1O3S1)]
dipole: 0.5990969 0.0049353 -0.9528407 debye
dipolederiv: -0.7726804 -0.0010177 0.1060047 -0.0010973 -0.0359786 -0.0000011 0.1231488 0.0000097 -0.0244143 2.1046419 0.0007453 -0.0264477 -0.0005704 1.1817549 -0.0018959 0.2680117 -0.0017272 1.5584657 -0.9922862 0.0002891 -0.1470993 0.0010992 -0.4321258 0.0010738 -0.3079313 0.0009965 -0.683957 -0.7088822 -0.03551 0.044819 -0.0327085 -0.5795396 0.150606 -0.0323341 0.0445293 -0.551344 -0.708922 0.0349363 0.0453684 0.0327728 -0.5776673 -0.1507284 -0.0319766 -0.0447806 -0.553134 -0.1096764 -0.0000704 0.0159391 -0.0005336 -0.1005319 0.0004822 0.1011388 0.00058 -0.1866827 -0.0624107 -0.1229057 -0.020188 0.3276461 -0.0198117 -0.0391613 -0.0125149 0.0349853 -0.0727734 -0.0621 0.1230437 -0.0189079 -0.3274173 -0.020049 0.0397188 -0.0159854 -0.0344889 -0.0726696 -0.4755529 0.1894091 0.052438 0.047281 0.008637 -0.0076787 0.0552042 -0.0319244 -0.0780498 -0.4752764 -0.1905483 0.0503676 -0.0484326 0.0079182 0.0086696 0.0546814 0.0329302 -0.0775929 1.457424 0.0020699 -0.232685 0.0021812 0.0960699 0.000833 -0.2556151 0.0008215 -0.0823797 0.6444206 -0.0007274 0.2219148 0.0011063 0.2454987 0.0010267 -0.1856068 0.0007724 0.0523332 0.1061433 0.0577923 0.0196826 0.0264329 0.0805651 0.0010787 0.0104553 -0.0175112 0.1528189 0.1061323 -0.0579564 0.0190617 -0.0265632 0.0802455 -0.001846 0.0101344 0.0167573 0.1529544 0.0290645 -0.0562311 0.0184599 -0.0485361 0.0161055 0.0057418 0.026465 0.0075213 0.1614577 0.0289492 0.056037 0.0190751 0.0482566 0.0163912 -0.007297 0.0269954 -0.0090633 0.1612925 -0.0424751 0.0365076 -0.0426828 0.0971018 -0.0537314 -0.0576818 0.0943983 -0.0848397 0.0982698 -0.0423925 -0.0361413 -0.0430967 -0.0980016 -0.0552289 0.0561889 0.0933459 0.0835169 0.0995667 -0.024121 0.000278 -0.0820236 -0.0000173 0.1414782 0.0008709 -0.0220152 0.0009148 -0.0541616 unknown
polarizability: 201.2816759|0.1097799|110.6560303|-8.7280635|0.1847984|76.1482711 unknown
InChI: InChI=1S/C7H7BrO3S/c1-11-12(9,10)7-4-2-6(8)3-5-7/h2-5H,1H3
charge 0 multiplicity 1
19 atoms
Br 4.632916 0.005859 -0.509068
S  -1.858877 -0.003796 0.586905
O  -2.381761 0.004069 -1.207499
O  -2.303005 -1.415062 1.249273
O  -2.304956 1.400703 1.262219
C  -0.016234 -0.000955 0.25328
C  0.63318 1.239189 0.154502
C  0.634614 -1.239212 0.14105
C  2.027803 1.238018 -0.072644
C  2.029234 -1.233989 -0.08608
C  2.703041 0.00303 -0.194027
C  -3.852887 0.003962 -1.358059
H  0.0774 2.174977 0.267332
H  0.079911 -2.176804 0.243746
H  2.573294 2.181776 -0.154167
H  2.575783 -2.176196 -0.177845
H  -4.300901 0.910812 -0.913213
H  -4.299916 -0.907529 -0.921791
H  -4.00344 0.009044 -2.450518
