program: Gaussian 09
title: 000220961
version: EM64L-G09RevD.01
frameworkgroup: C1[X(C5H8BrCl3)]
method: RPBEPBE
basis: SDD
operation: Freq
keyword: #p
keyword: freq=noraman
keyword: PBEPBE/SDD
title: #p freq=noraman PBEPBE/SDD
converged: YES YES NO NO
title: Mulliken charges:
elementType: Br Cl Cl Cl C C C C C H H H H H H H H
charge: -0.029069 0.083721 0.103686 0.093988 0.084760 -0.446806 -0.630662 -0.669052 -0.653046 0.292828 0.309622 0.235323 0.240068 0.245524 0.251621 0.239087 0.248407
chargesum: 0.00000
title: Mulliken charges with hydrogens summed into heavy atoms:
elementType: Br Cl Cl Cl C C C C C
charge: -0.029069 0.083721 0.103686 0.093988 0.377588 -0.137183 -0.630662 0.051863 0.086068
polarizability: 1.15327778e+02 6.55699351e+00 9.30736623e+01 -2.06163291e+00 2.30929180e+00 8.77414333e+01
1716.lowfreq: -12.9585 -5.9698 -0.0017 -0.0005 0.0009 6.2129 39.1755 78.7061 135.2973
frequency: 38.8686 78.6052 135.2943 157.2578 181.2902 211.7133 223.3587 251.0714 258.6867 272.6952 281.8943 310.8839 327.5585 366.0951 495.6286 545.7612 594.6707 707.9333 728.6865 804.2972 921.0613 971.8733 1010.2552 1035.4976 1089.8448 1120.2639 1162.8491 1205.6116 1283.0950 1314.7416 1346.9283 1390.5811 1396.5097 1461.1614 1467.1552 1477.2128 1490.5770 2996.1964 3007.4417 3010.6843 3086.4811 3093.3564 3106.8615 3113.2288 3117.9391
redmass: 5.3649 6.5176 7.2508 13.1172 5.2645 1.4647 3.3509 2.6467 1.6157 3.9083 2.7390 4.1716 9.1626 7.8582 5.2999 2.8951 4.2419 5.7256 5.7653 3.2461 2.2413 1.6975 1.3610 1.6880 2.2060 2.0469 2.4713 1.2408 1.4101 1.2337 1.3256 1.2044 1.1978 1.0441 1.0454 1.0436 1.0505 1.0368 1.0387 1.0795 1.0911 1.0947 1.0998 1.0992 1.0995
irintensity: 1.1419 1.1282 1.1943 0.1144 0.1881 0.9805 2.0095 0.2192 0.8100 3.8457 0.5031 3.1184 6.8616 6.3524 48.7182 11.7199 34.7892 133.0708 102.0519 14.4973 63.0472 13.2119 3.0588 54.0278 10.7839 21.1585 4.0743 25.2725 6.7420 5.8949 4.2092 17.9618 31.7713 4.7143 17.9366 22.8134 2.8576 9.5494 9.4829 6.2034 2.9690 4.2542 6.8392 24.5718 6.8948
temp: 298.150 k
press: 1.00000 atm
elementType: 35 17 17 17 6 6 6 6 6 1 1 1 1 1 1 1 1
symmnumber: 1
zpe: 314914.9 jmol-1
zpe.correction: 0.119945 hartree
zpe.thermalcorrener: 0.131549 hartree
zpe.thermalcorrenthalpy: 0.132493 hartree
zpe.thermalcorrgfe: 0.080684 hartree
zpe.sumelectzpe: -1588.237254 hartree
zpe.sumelectthermal: -1588.225650 hartree
zpe.sumelectthermalent: -1588.224705 hartree
zpe.sumelectthermalfe: -1588.276515 hartree
dipole: -0.1856 1.2535 -0.6655
dipole: 1.4313
quadrupole: -94.9903 -83.3653 -83.1892
quadrupole: -1.5537 -0.6710 0.8629
quadrupole: -7.8087 3.8163 3.9924 -1.5537 -0.6710 0.8629
hfenergy: -1588.3571987 hartree
pointgroup: C01 [X(C5H8Br1Cl3)]
dipole: 0.1759291 -0.5063558 0.1725549 debye
dipolederiv: -0.4976755 -0.1371838 0.1761662 -0.1230978 -0.1944326 0.0853656 0.1869971 0.1169085 -0.3215432 -0.215062 -0.0531729 0.0751363 -0.034646 -0.4318245 0.3003052 0.0612692 0.3112356 -0.5005321 -0.5684079 -0.073969 -0.3006682 -0.0451866 -0.158752 -0.0523089 -0.336385 -0.0742589 -0.4679943 -0.2210358 0.0563725 0.0343431 0.0332962 -0.7135418 -0.2195414 0.0227274 -0.2286647 -0.2424144 -0.1130494 -0.0251805 -0.0589359 -0.0109908 -0.1350272 0.0287142 0.115142 0.0841137 -0.2428486 0.6437405 0.2105366 -0.2710486 0.2562728 0.1717882 -0.2060265 -0.2296798 -0.2649282 0.4697656 0.9755383 0.0366187 0.1842744 0.0059736 1.3021602 -0.0593416 0.1094112 -0.0544926 1.2471675 -0.1245425 0.0589985 0.0546468 -0.0337879 -0.0073586 -0.0424701 0.0093293 -0.0847447 0.0231696 -0.1719496 -0.0724282 0.0725271 -0.020256 -0.0360334 0.1075822 0.0017043 0.1609255 -0.1594317 0.0309864 0.0044968 0.0209189 0.0445216 0.0056486 0.0357515 -0.0310159 0.0560286 0.0241242 0.0209459 0.0236929 0.062298 -0.0370292 -0.0319971 0.0039255 0.0297271 -0.0161544 -0.0192156 0.1157834 -0.0129084 0.0115452 0.0105925 0.002782 0.0538225 0.004504 0.1231306 -0.0208361 0.0111641 -0.0621868 -0.134523 -0.0266617 0.0792906 0.0002876 -0.1016679 -0.0370824 0.0183261 -0.0440758 0.0428824 0.0940603 0.0405562 0.0743591 -0.0088031 0.0864743 -0.0059783 0.0802388 0.1099431 0.0454725 0.0058292 0.052784 -0.0494965 -0.0503856 0.0443721 -0.0989337 0.0504893 0.080189 -0.0065672 0.0916743 -0.0438619 0.0580961 0.0750306 0.1229662 0.0472079 0.0112946 -0.0324922 -0.0354739 -0.1182439 -0.068479 0.0643389 -0.0519077 -0.0958757 -0.0343127 0.0502401 unknown
polarizability: 111.4716652|8.6436319|89.7827295|-6.6366808|-4.3992531|94.8884788 unknown
InChI: InChI=1S/C5H8BrCl3/c1-3(4(2)6)5(7,8)9/h3-4H,1-2H3
charge 0 multiplicity 1
17 atoms
Br 2.950026 0.807107 -0.952585
Cl -1.528957 -1.131751 1.453935
Cl -2.532821 -0.136331 -1.214488
Cl -1.367319 1.813314 0.763579
C  0.203158 -0.119109 -0.598795
C  1.396162 0.307211 0.31484
C  -1.182257 0.077923 0.069879
C  0.366446 -1.541006 -1.181301
C  1.92541 -0.708669 1.328118
H  0.183329 0.60304 -1.43932
H  1.18382 1.278733 0.786842
H  0.29708 -2.313304 -0.397443
H  -0.404596 -1.7461 -1.941029
H  1.355749 -1.612822 -1.664393
H  2.262236 -1.638172 0.840985
H  1.131053 -0.962135 2.054286
H  2.777783 -0.28203 1.881992
