program: Gaussian 09
title: 000220957
version: EM64L-G09RevD.01
frameworkgroup: C1[X(C15H31Cl)]
method: RPBEPBE
basis: SDD
operation: Freq
keyword: #p
keyword: freq=noraman
keyword: PBEPBE/SDD
title: #p freq=noraman PBEPBE/SDD
converged: YES YES NO NO
title: Mulliken charges:
elementType: Cl C C C C C C C C C C C C C C C H H H H H H H H H H H H H H H H H H H H H H H H H H H H H H H
charge: -0.124798 -0.010678 -0.414326 -0.394773 -0.439574 -0.375598 -0.405098 -0.360603 -0.355267 -0.349033 -0.358125 -0.361165 -0.359810 -0.699034 -0.696933 -0.695535 0.225019 0.204730 0.234058 0.217304 0.237597 0.201096 0.216346 0.197855 0.203679 0.205350 0.192255 0.218672 0.192693 0.181853 0.191417 0.193004 0.198941 0.190075 0.200076 0.193831 0.195373 0.195607 0.208031 0.214807 0.215945 0.208495 0.211037 0.216214 0.211239 0.216534 0.211215
chargesum: 0.00000
title: Mulliken charges with hydrogens summed into heavy atoms:
elementType: Cl C C C C C C C C C C C C C C C
charge: -0.124798 -0.010678 0.015423 0.056589 -0.000881 0.038603 0.003932 0.050325 0.019279 0.035388 0.030891 0.032741 0.031170 -0.060252 -0.061187 -0.056547
polarizability: 1.95485250e+02 -9.37605037e-01 1.73529668e+02 -3.72959816e+00 3.86243943e+00 1.54547249e+02
1716.lowfreq: -0.0008 0.0005 0.0015 1.4619 6.4722 12.2647 20.5731 34.7088 37.7754
frequency: 18.4623 34.6944 37.6947 46.8876 57.4805 63.6475 71.3615 86.3846 98.1947 117.3167 126.1219 139.6571 154.8058 161.4829 183.5596 190.5477 220.0241 222.5949 232.5296 233.7234 265.5775 286.8684 294.1966 326.8929 352.1697 392.1075 426.5885 437.8572 488.0882 542.1529 601.6615 723.6876 726.7264 731.7367 749.0088 753.5362 784.3077 809.0803 832.9060 847.0787 888.9163 896.0219 898.4418 919.1481 947.6377 960.7616 1004.8989 1007.1921 1015.5916 1036.6241 1045.6004 1059.9141 1070.9505 1076.1841 1083.3882 1088.1593 1097.8806 1110.7651 1115.0970 1136.2582 1173.4859 1185.1239 1202.9643 1217.1611 1221.9209 1241.8985 1249.5357 1258.4574 1268.8179 1279.7251 1283.7924 1285.1033 1288.7851 1293.8716 1296.7906 1302.7336 1306.2182 1315.2826 1338.8735 1342.8877 1351.6347 1352.3689 1358.6641 1365.0325 1387.7450 1388.5317 1390.1537 1441.4751 1450.3559 1462.2762 1464.6895 1465.7244 1466.6214 1469.6316 1473.2494 1475.4969 1475.6087 1477.6561 1477.8519 1480.1294 1482.3795 1486.3873 1487.6009 1490.4292 2949.5367 2950.8111 2955.0065 2956.7075 2961.6755 2963.7225 2965.9564 2971.3607 2972.0727 2972.3485 2972.5878 2975.4807 2975.8723 2992.7115 2993.9892 2996.9880 3005.4637 3013.2292 3016.3597 3023.9600 3029.9476 3034.2568 3049.1328 3051.1112 3062.7102 3068.3567 3069.1742 3069.8265 3070.7591 3071.8748 3072.1266
redmass: 2.4434 2.4257 2.7538 2.9325 1.7401 1.5711 3.3895 3.2593 3.0161 2.3346 2.6375 2.0289 2.2125 2.7719 3.4635 3.3398 2.2437 1.3954 1.1663 1.1428 2.6087 2.5539 2.8122 2.8788 3.6459 3.0907 3.3567 3.0412 2.9608 3.0880 2.8618 1.0703 1.0734 1.0934 1.1587 1.1726 1.3178 2.1094 1.2725 1.4657 1.8833 1.8276 1.6990 1.3202 1.3453 1.2868 2.8834 2.9180 2.4941 2.8318 2.7452 1.9721 2.3536 2.2925 2.2576 1.9650 1.6853 2.1217 2.3352 1.9218 2.5677 2.1162 1.5132 1.4096 1.4988 1.2911 1.3497 1.2608 1.2894 1.2492 1.1867 1.0769 1.0591 1.0897 1.1478 1.2881 1.2733 1.3779 1.4823 1.4465 1.5967 1.6017 1.5672 1.5831 1.2161 1.2191 1.2176 1.0801 1.0758 1.0727 1.0689 1.0716 1.0697 1.0744 1.0679 1.0696 1.0439 1.0425 1.0423 1.0720 1.0718 1.0800 1.0871 1.0923 1.0615 1.0637 1.0588 1.0618 1.0588 1.0593 1.0594 1.0366 1.0578 1.0380 1.0366 1.0609 1.0610 1.0968 1.0969 1.0637 1.0979 1.1000 1.0963 1.1012 1.0941 1.1032 1.1021 1.1018 1.1020 1.1007 1.1007 1.1006 1.0993 1.0997 1.0993
irintensity: 0.0113 0.0076 0.1230 0.0422 0.0773 0.0317 0.7887 0.4114 0.1357 0.2622 0.3576 0.1489 0.0232 0.7679 0.8963 0.3776 1.1568 0.4596 0.1727 0.0734 0.8804 0.4124 0.8626 1.0516 9.2223 1.4048 6.6248 3.4053 1.2436 7.3931 10.2021 11.6844 11.2239 13.4152 0.5692 0.3978 0.1189 2.1383 4.4049 10.9303 6.1431 4.0887 11.3461 4.2730 2.5553 3.6524 0.5277 3.3885 0.9601 1.6490 0.5204 3.2870 0.9625 0.2258 1.4470 2.3646 7.7125 5.6793 10.6676 20.5650 1.9605 4.9120 0.1987 1.9384 2.5500 12.6842 2.9594 2.1389 5.6794 1.2205 1.9221 0.8191 1.1375 0.3562 2.8834 3.5875 10.9634 5.4872 8.1298 5.0215 0.4965 0.9673 1.6356 3.0823 11.3129 15.2578 11.0417 3.0805 4.0039 0.4018 0.3766 0.7848 2.8444 0.5983 3.8714 7.3448 10.4167 11.8979 13.1015 3.1811 7.7452 26.3288 17.6380 3.4371 8.7696 6.3587 3.2863 28.5189 26.1291 11.3373 30.7604 42.8595 70.3836 32.6286 36.3943 38.7801 66.4780 5.8048 1.3379 26.7125 7.3199 2.3217 19.1038 6.6971 3.4566 36.8412 59.9686 27.8546 36.4066 91.7332 114.3494 82.4168 55.9612 36.3463 70.7889
temp: 298.150 k
press: 1.00000 atm
elementType: 17 6 6 6 6 6 6 6 6 6 6 6 6 6 6 6 1 1 1 1 1 1 1 1 1 1 1 1 1 1 1 1 1 1 1 1 1 1 1 1 1 1 1 1 1 1 1
symmnumber: 1
zpe: 1121732.7 jmol-1
zpe.correction: 0.427245 hartree
zpe.thermalcorrener: 0.449458 hartree
zpe.thermalcorrenthalpy: 0.450402 hartree
zpe.thermalcorrgfe: 0.373222 hartree
zpe.sumelectzpe: -1048.915455 hartree
zpe.sumelectthermal: -1048.893243 hartree
zpe.sumelectthermalent: -1048.892299 hartree
zpe.sumelectthermalfe: -1048.969479 hartree
dipole: 0.8636 -1.1937 -2.2916
dipole: 2.7244
quadrupole: -110.3158 -111.2502 -116.4970
quadrupole: 0.2908 1.3345 -3.2143
quadrupole: 2.3719 1.4375 -3.8093 0.2908 1.3345 -3.2143
hfenergy: -1049.3427006 hartree
pointgroup: C01 [X(C15H31Cl1)]
dipole: -0.3292556 0.4373086 -0.9215329 debye
polarizability: 195.4100077|-0.9138166|173.2201052|4.0582842|-4.6080862|154.932054 unknown
InChI: InChI=1S/C15H31Cl/c1-4-7-10-13-15(16,12-9-6-3)14-11-8-5-2/h4-14H2,1-3H3
charge 0 multiplicity 1
47 atoms
Cl 0.725724 -1.105168 2.399537
C  0.157037 -0.273303 0.703266
C  1.297245 0.696468 0.321203
C  -1.144064 0.473342 1.074381
C  -0.024558 -1.432072 -0.298196
C  2.670138 0.073268 -0.012541
C  -1.855778 1.157042 -0.122834
C  -1.177534 -2.418371 -0.012893
C  3.75614 1.152183 -0.228277
C  -3.139323 1.898577 0.316523
C  -1.173225 -3.614552 -0.99249
C  5.136841 0.560275 -0.592582
C  -3.877955 2.57827 -0.85926
C  -2.331555 -4.601926 -0.734447
C  6.217638 1.642521 -0.804169
C  -5.150985 3.331009 -0.415577
H  1.41846 1.421447 1.149766
H  0.948317 1.278623 -0.558838
H  -1.843312 -0.237803 1.550824
H  -0.901778 1.236609 1.839041
H  0.92434 -1.996559 -0.354177
H  -0.171489 -0.97341 -1.300914
H  2.972583 -0.598623 0.814099
H  2.597863 -0.55035 -0.925958
H  -1.17415 1.880358 -0.613141
H  -2.119802 0.400325 -0.888951
H  -2.155035 -1.899586 -0.08176
H  -1.085205 -2.79105 1.02608
H  3.852837 1.763679 0.693136
H  3.435418 1.84892 -1.03195
H  -2.879504 2.663772 1.077307
H  -3.82598 1.184177 0.816671
H  -0.204949 -4.148497 -0.906917
H  -1.230573 -3.238782 -2.035135
H  5.457533 -0.133914 0.210565
H  5.039648 -0.052509 -1.512234
H  -3.186879 3.283725 -1.364506
H  -4.144466 1.810268 -1.614005
H  -3.312149 -4.10121 -0.844782
H  -2.279243 -5.012116 0.29159
H  -2.305033 -5.452169 -1.440546
H  5.934937 2.329949 -1.623941
H  6.353202 2.250008 0.110536
H  7.19554 1.195005 -1.06057
H  -5.870108 2.6436 0.068569
H  -5.661936 3.804063 -1.274267
H  -4.907072 4.127181 0.312869
