program: Gaussian 09
title: 000220995
version: EM64L-G09RevD.01
frameworkgroup: C1[X(C20H20O6)]
method: RPBEPBE
basis: SDD
operation: Freq
keyword: #pfreq=noraman
keyword: PBEPBE/SDD
title: #p freq=noraman PBEPBE/SDD
converged: YES YES NO NO
title: Mulliken charges:
elementType: O O O O O O C C C C C C C C C C C C C C C C C C C C H H H H H H H H H H H H H H H H H H H H
charge: -0.193622 -0.213165 -0.322044 -0.428888 -0.324003 -0.427988 -0.213323 -0.241309 -0.400141 -0.695343 -0.353114 0.399155 0.429853 0.174357 0.501827 -0.598512 -0.606836 -0.536189 -0.392284 0.125068 0.206178 0.206997 -0.357350 0.120221 -0.523314 -0.522549 0.263283 0.268423 0.228793 0.259887 0.249019 0.227857 0.250574 0.269420 0.257537 0.238931 0.258731 0.252028 0.380824 0.232499 0.227098 0.244853 0.379290 0.224520 0.226556 0.246198
chargesum: 0.00000
title: Mulliken charges with hydrogens summed into heavy atoms:
elementType: O O O O O O C C C C C C C C C C C C C C C C C C C C
charge: -0.193622 -0.213165 -0.322044 -0.048064 -0.324003 -0.048699 0.049960 0.027113 -0.171348 -0.186437 0.125317 0.399155 0.429853 0.174357 0.501827 -0.329092 -0.349299 -0.297259 -0.133553 0.125068 0.206178 0.206997 -0.105321 0.120221 0.181136 0.174725
polarizability: 3.05959659e+02 -1.84389703e+01 2.04565835e+02 -1.15778719e+01 4.64626907e+00 1.94639927e+02
1716.lowfreq: -4.6641 0.0009 0.0009 0.0010 4.0682 7.4044 19.0513 32.5246 35.4144
frequency: 18.7601 32.5146 35.3529 44.6354 72.2474 80.1131 89.7759 109.5684 138.4583 141.3738 163.9286 173.2986 181.8053 192.5131 227.7712 232.2859 245.1398 250.7419 263.0237 273.2057 302.0920 326.3599 346.3379 351.2885 382.2531 411.6722 440.7952 444.8380 462.3322 479.3652 487.5306 491.6232 494.6694 520.7254 538.4518 561.8720 574.3077 597.7076 611.1292 621.2275 660.4264 675.8133 682.3384 712.7908 718.0492 734.3602 754.0841 772.4716 780.4466 802.5898 827.1642 836.0376 845.4955 849.9265 876.8388 881.9666 904.6337 947.2331 953.1758 967.6711 977.9032 987.1828 1007.0300 1019.5893 1028.2089 1092.9564 1108.0441 1115.2457 1117.0270 1118.2506 1126.8085 1142.7076 1153.8930 1155.7860 1171.9304 1174.2492 1182.2788 1186.7467 1191.5695 1208.9152 1214.4715 1221.9418 1240.3855 1256.4899 1263.0472 1274.1593 1280.9197 1299.0917 1306.8730 1317.0422 1324.8324 1342.6793 1367.1185 1403.6484 1414.3909 1421.1288 1441.1888 1445.8297 1449.9869 1465.8577 1466.1464 1467.7104 1473.1266 1475.3149 1481.3971 1503.3399 1508.0997 1599.0944 1609.4374 1620.7001 1631.1370 1693.9748 2948.8382 2964.7099 2968.6250 2985.9495 3020.3620 3022.2375 3040.5364 3049.1560 3054.1865 3059.8289 3095.9687 3127.1474 3129.5981 3131.3005 3144.8626 3147.2993 3151.5561 3171.6350 3514.4283 3516.3238
redmass: 4.3710 5.8740 8.2296 4.8309 4.6027 5.7628 3.6313 5.3083 4.2746 6.3874 3.6574 3.4221 2.5805 1.7652 2.9784 2.5023 2.7225 2.6330 2.9480 4.0751 2.6712 4.1643 4.8699 5.5381 4.3356 6.5343 3.1792 3.0875 5.2614 5.1634 1.1268 5.0425 1.1288 5.6608 4.7383 4.4173 6.7118 4.4788 4.5429 6.6385 8.4030 5.2463 5.6708 4.5286 3.7529 5.0864 4.2042 4.2710 3.5425 3.9930 1.7162 1.8884 2.0218 1.5235 2.3786 1.7998 4.3125 1.9812 2.1053 4.9242 2.3540 3.5674 4.7428 2.3377 2.9566 3.5619 2.7604 2.2228 1.2664 1.2581 3.4576 1.8137 1.4058 1.4204 1.2484 1.5532 1.6756 1.3803 1.4698 2.1538 1.3119 2.0074 1.4704 1.3051 2.4041 1.4363 1.7492 1.7152 1.7192 1.4726 1.5044 1.4607 1.6782 4.3525 3.3054 2.7462 1.4614 1.4246 2.3269 1.0526 1.0495 1.1512 1.1004 1.1012 1.0844 2.9677 3.2857 7.5992 6.5159 6.8764 6.9559 12.4000 1.0829 1.0327 1.0324 1.0629 1.0824 1.0611 1.0857 1.0989 1.1044 1.1046 1.1079 1.0969 1.1003 1.0929 1.0910 1.0884 1.0922 1.0958 1.0646 1.0646
irintensity: 1.3989 2.2824 3.8995 2.0092 4.1917 2.0230 5.0621 2.6299 0.1121 0.5402 1.9692 1.2218 1.2016 0.7829 0.6375 0.2738 3.2596 3.5367 1.6952 4.0350 3.0972 9.2959 1.2252 2.6152 3.7953 3.3548 5.4831 5.9936 11.1417 15.9005 125.9368 15.1160 126.1091 7.1971 17.8134 1.3007 17.6225 16.2739 6.6924 6.4638 0.0876 5.4417 10.2127 1.3269 1.5254 10.2905 32.8977 5.8270 18.0132 30.4939 9.3976 5.1458 9.2046 22.1104 13.9097 13.5513 13.1284 10.9804 20.2139 63.0415 22.3658 17.6419 57.6413 14.6821 31.4098 172.3367 42.7466 18.0676 0.5100 0.2309 7.7735 9.9545 29.6712 28.7472 33.8032 123.2010 13.4810 211.1427 4.8141 72.2390 5.0395 92.1768 35.4038 0.9924 150.0136 7.0843 35.1486 65.7191 18.3680 34.0834 10.9064 16.8655 27.9312 23.3264 40.8406 13.2442 18.9153 19.1431 4.1732 16.1824 15.1727 14.3392 116.6246 50.3223 7.0000 232.3051 108.8318 22.3588 5.0597 14.9584 16.9834 300.5205 20.6339 54.6925 56.0741 19.9688 10.9122 36.3485 28.1506 11.8945 42.9391 39.1087 30.1427 26.0454 23.6708 10.6093 8.6147 4.8382 1.6732 5.0760 102.1993 82.7467
temp: 298.150 k
press: 1.00000 atm
elementType: 8 8 8 8 8 8 6 6 6 6 6 6 6 6 6 6 6 6 6 6 6 6 6 6 6 6 1 1 1 1 1 1 1 1 1 1 1 1 1 1 1 1 1 1 1 1
symmnumber: 1
zpe: 947370.9 jmol-1
zpe.correction: 0.360835 hartree
zpe.thermalcorrener: 0.384279 hartree
zpe.thermalcorrenthalpy: 0.385223 hartree
zpe.thermalcorrgfe: 0.307126 hartree
zpe.sumelectzpe: -1223.560309 hartree
zpe.sumelectthermal: -1223.536865 hartree
zpe.sumelectthermalent: -1223.535921 hartree
zpe.sumelectthermalfe: -1223.614017 hartree
dipole: -1.8835 -1.0289 1.1789
dipole: 2.4486
quadrupole: -119.8050 -178.9356 -150.2008
quadrupole: -31.2433 -21.1170 12.2905
quadrupole: 29.8421 -29.2884 -0.5537 -31.2433 -21.1170 12.2905
hfenergy: -1223.9211436 hartree
pointgroup: C01 [X(C20H20O6)]
dipole: -0.8207176 -0.4073975 0.2975242 debye
polarizability: 302.7350675|-27.5040226|207.034742|-5.6496481|5.7587336|195.3956122 unknown
InChI: InChI=1S/C20H20O6/c1-24-17-6-10(3-4-15(17)21)19-12-8-16(22)18(25-2)7-11(12)5-13-14(19)9-26-20(13)23/h3-4,6-8,13-14,19,21-22H,5,9H2,1-2H3
charge 0 multiplicity 1
46 atoms
O  1.599725 3.11251 1.65981
O  2.41427 3.82703 -0.389337
O  4.593132 -2.540308 -0.10233
O  2.980518 -3.470528 1.825411
O  -5.360387 0.103099 -0.228251
O  -4.936836 -1.478462 -2.346897
C  -0.208395 1.616808 0.939789
C  0.549814 2.163865 -0.306649
C  -0.428855 0.066026 0.941807
C  1.206783 1.076802 -1.210887
C  0.665299 2.062247 2.151232
C  0.893181 -0.626043 0.629461
C  1.713561 -0.106612 -0.406876
C  1.618774 3.121092 0.252048
C  -1.604924 -0.350905 0.033917
C  1.324458 -1.750469 1.373514
C  2.963678 -0.713033 -0.687443
C  -2.913247 0.108447 0.35882
C  -1.444886 -1.198493 -1.085786
C  2.557784 -2.359397 1.089532
C  3.382881 -1.832406 0.054336
C  -4.012382 -0.266961 -0.432161
C  -2.550649 -1.575885 -1.88472
C  -3.835955 -1.110295 -1.567438
C  5.532392 -2.060184 -1.1180
C  -5.667889 0.95002 0.923855
H  -1.1915 2.114971 1.005008
H  -0.116658 2.772947 -0.943049
H  -0.719641 -0.207316 1.979225
H  2.018438 1.544449 -1.797163
H  0.440481 0.734099 -1.93248
H  0.082223 2.515563 2.968684
H  1.284172 1.23625 2.543077
H  0.707772 -2.169118 2.17529
H  3.595544 -0.295805 -1.478374
H  -3.062876 0.740653 1.241973
H  -0.452044 -1.588676 -1.329995
H  -2.429441 -2.234155 -2.749898
H  3.872482 -3.748776 1.485784
H  5.85307 -1.023787 -0.900004
H  5.080162 -2.108353 -2.126953
H  6.39633 -2.738321 -1.063695
H  -5.750251 -1.060723 -1.95704
H  -5.146086 1.923603 0.850151
H  -5.390304 0.447107 1.870149
H  -6.755718 1.108021 0.891748
