program: Gaussian 09
title: 000220951
version: EM64L-G09RevD.01
frameworkgroup: C1[X(C13H10Br2N2O)]
method: RPBEPBE
basis: SDD
operation: Freq
keyword: #p
keyword: freq=noraman
keyword: PBEPBE/SDD
title: #p freq=noraman PBEPBE/SDD
converged: YES YES NO NO
title: Mulliken charges:
elementType: Br Br O N N C C C C C C C C C C C C C H H H H H H H H H H
charge: -0.009996 -0.010034 -0.246254 -0.676179 -0.676269 0.312675 0.313492 -0.000424 -0.332661 -0.333395 -0.365254 -0.365630 0.609767 0.609682 -0.445654 -0.445468 -0.394057 -0.394046 0.285208 0.285407 0.273542 0.273515 0.226860 0.226820 0.324589 0.314539 0.324680 0.314545
chargesum: 0.00000
title: Mulliken charges with hydrogens summed into heavy atoms:
elementType: Br Br O N N C C C C C C C C C C C C C
charge: -0.009996 -0.010034 -0.246254 -0.037052 -0.037044 0.312675 0.313492 -0.000424 -0.047453 -0.047988 -0.091711 -0.092115 0.609767 0.609682 -0.445654 -0.445468 -0.167197 -0.167226
polarizability: 3.09846854e+02 4.94214781e-02 2.27179616e+02 -3.91769746e+01 -1.62406262e-03 1.07920365e+02
1716.lowfreq: -4.5576 -2.5754 -0.0005 0.0005 0.0006 1.5605 27.1357 34.1959 35.5541
frequency: 27.1356 34.1959 35.5504 102.7646 109.3105 115.6889 145.9838 173.9044 222.1915 228.8115 242.8278 272.7197 278.0849 282.4727 317.1983 370.0909 421.3349 425.8796 427.3522 435.8723 440.8272 448.2231 474.1574 474.7274 515.9214 527.9720 585.8393 604.4776 646.8117 661.8021 702.2730 706.5880 737.0036 760.5035 822.6199 829.5414 836.4774 845.5594 894.5193 922.3756 929.3990 972.8098 973.8369 1011.2893 1017.0414 1032.2504 1032.4751 1154.5513 1156.2092 1159.0682 1250.5826 1280.5958 1304.8231 1329.9369 1333.0515 1363.4444 1366.3211 1425.3891 1425.6381 1504.6813 1509.6697 1512.5211 1539.9690 1553.9324 1611.2362 1616.2690 1636.3814 1641.1053 3128.9444 3129.0060 3160.6269 3163.4392 3164.2422 3167.8495 3542.6437 3543.3114 3689.9740 3690.1404
redmass: 12.5247 12.0536 6.1462 7.9878 5.0450 10.1189 4.8951 5.9175 5.7074 5.8201 6.4018 10.4305 6.9611 8.8700 5.3674 7.7816 1.5667 1.4366 2.2603 1.7497 2.9138 2.7531 1.1695 1.1929 4.5900 4.1783 3.9318 7.0446 7.1642 7.3369 4.2301 6.3258 4.5160 3.8216 4.9650 1.5812 1.6643 5.3035 1.6120 1.3225 5.3266 1.3626 1.3913 2.5039 2.4236 1.6252 1.7194 1.1842 2.8268 1.1805 1.5240 1.3729 1.9658 2.4068 3.7651 4.4935 4.2994 6.3332 6.3041 3.9685 7.1650 3.6300 6.8843 7.7557 2.7533 2.0688 1.6064 2.0220 1.0891 1.0890 1.0921 1.0945 1.0952 1.0926 1.0459 1.0461 1.1032 1.1032
irintensity: 0.0523 1.0984 6.5241 1.7359 0.5703 1.9291 0.8272 1.0440 1.3944 0.6908 1.7442 2.7524 19.4920 11.8145 0.6768 1.7297 142.9369 27.8048 6.5941 20.6519 14.3763 1.5850 302.3672 61.9118 0.0428 22.1371 0.3954 38.8725 5.4407 33.5310 0.0613 52.2068 4.8405 48.4297 6.9309 17.0166 49.5697 11.3001 27.8827 1.9891 27.0894 0.2534 9.9254 18.7709 5.3273 15.6417 48.8199 142.1131 64.5885 1.3124 300.5347 2.8013 271.2663 13.7112 286.4590 92.6281 0.9665 6.6403 38.3920 4.1520 238.3290 19.8360 6.8781 30.2894 115.1437 1.1997 866.2395 38.7992 27.9292 6.3100 5.8670 1.8533 8.7354 0.0630 206.3813 53.1581 40.9704 39.7239
temp: 298.150 k
press: 1.00000 atm
elementType: 35 35 8 7 7 6 6 6 6 6 6 6 6 6 6 6 6 6 1 1 1 1 1 1 1 1 1 1
symmnumber: 1
zpe: 527147.9 jmol-1
zpe.correction: 0.200780 hartree
zpe.thermalcorrener: 0.217664 hartree
zpe.thermalcorrenthalpy: 0.218608 hartree
zpe.thermalcorrgfe: 0.153827 hartree
zpe.sumelectzpe: -711.793581 hartree
zpe.sumelectthermal: -711.776697 hartree
zpe.sumelectthermalent: -711.775753 hartree
zpe.sumelectthermalfe: -711.840534 hartree
dipole: 0.0035 -2.0497 0.0136
dipole: 2.0497
quadrupole: -68.5812 -136.4766 -123.1425
quadrupole: 0.0315 -18.9871 0.0069
quadrupole: 40.8189 -27.0765 -13.7424 0.0315 -18.9871 0.0069
hfenergy: -711.9943608 hartree
pointgroup: C01 [X(C13H10Br2N2O1)]
dipole: 0.032993 -0.7427055 0.3124577 debye
polarizability: 313.1810446|-7.9663854|207.3785525|-27.6973457|-45.3348841|124.387238 unknown
InChI: InChI=1S/C13H10Br2N2O/c14-9-5-7(1-3-11(9)16)13(18)8-2-4-12(17)10(15)6-8/h1-6H,16-17H2
charge 0 multiplicity 1
28 atoms
Br -3.02357 -3.193164 0.083056
Br 3.105013 -2.134577 1.891573
O  -0.201442 2.570978 -1.255729
N  -5.143664 -0.971568 0.851607
N  5.068881 -1.004584 -0.320751
C  -1.406071 0.732466 -0.294957
C  1.176003 0.709315 -0.629966
C  -0.146486 1.397723 -0.752213
C  -1.580844 -0.679413 -0.272858
C  1.461541 -0.260618 0.370987
C  -2.518277 1.551826 0.048984
C  2.230247 1.106228 -1.500328
C  -3.931411 -0.423681 0.47371
C  3.806372 -0.447627 -0.412864
C  -2.814379 -1.229838 0.09815
C  2.745024 -0.812958 0.46961
C  -3.741621 0.995067 0.434394
C  3.504574 0.538359 -1.40661
H  -0.76926 -1.341716 -0.586504
H  0.695302 -0.548073 1.096081
H  -2.390118 2.637762 -0.00235
H  2.015392 1.877545 -2.246788
H  -4.581298 1.643903 0.710376
H  4.298613 0.846161 -2.097246
H  -5.270012 -1.98154 0.867115
H  -5.925267 -0.37332 1.102959
H  5.274977 -1.699728 0.39379
H  5.807883 -0.717028 -0.955728
