program: Gaussian 09
title: 000220946
version: EM64L-G09RevD.01
frameworkgroup: C1[X(C9H8INO2S)]
method: RPBEPBE
basis: SDD
operation: Freq
keyword: #p
keyword: freq=noraman
keyword: PBEPBE/SDD
title: #p freq=noraman PBEPBE/SDD
converged: YES YES NO NO
title: Mulliken charges:
elementType: I S O O N C C C C C C C C C H H H H H H H H
charge: 0.141336 0.890803 -0.546985 -0.515764 0.026470 -0.530816 -0.038874 -0.584951 -0.262991 -0.264313 -0.200288 -0.200431 -0.213581 -0.003601 0.307895 0.299834 0.376806 0.292525 0.290935 0.246961 0.246363 0.242667
chargesum: 0.00000
title: Mulliken charges with hydrogens summed into heavy atoms:
elementType: I S O O N C C C C C C C C C
charge: 0.141336 0.890803 -0.546985 -0.515764 0.026470 0.076913 -0.038874 -0.208145 0.029534 0.026622 0.046673 0.045932 0.029086 -0.003601
polarizability: 2.14057489e+02 -5.18537881e+00 1.55671542e+02 -9.04418515e+00 -1.28056246e+01 1.11037063e+02
1716.lowfreq: -19.7909 -0.0019 -0.0015 0.0009 3.3372 6.5384 20.3892 26.2740 38.1653
frequency: 17.3273 26.0979 38.0971 62.0925 102.5644 126.5692 142.1041 153.8525 190.0422 232.7266 241.6940 243.9021 334.9718 342.5251 379.0104 404.0731 450.6063 461.1430 531.0948 555.9437 600.7158 636.8591 658.6896 690.8919 761.4977 785.9718 807.4523 853.4356 900.8997 936.7728 974.1067 978.3949 985.4559 1007.7164 1008.4546 1043.3325 1067.2282 1076.6018 1096.4853 1150.4713 1174.7923 1177.3201 1210.0605 1301.2106 1338.7027 1382.8419 1409.4877 1435.5269 1450.8786 1574.8723 1602.8213 2192.2384 3042.7603 3071.2029 3139.3851 3146.7325 3154.2511 3164.1024 3174.4802 3175.4923
redmass: 8.4637 5.2382 6.6279 6.0063 11.6564 11.3586 7.2380 7.6825 7.4035 7.1612 4.0935 5.3321 6.8275 8.2561 12.5404 2.8333 7.9093 4.9895 5.6452 4.8464 6.4821 5.2576 6.6654 2.4593 1.4239 6.8622 2.8819 1.2430 4.9489 1.3526 3.4345 4.6037 1.3940 3.7767 1.3922 2.1447 1.5601 1.5583 1.8243 1.2090 1.0594 1.1251 1.1629 1.3085 1.3484 8.1281 1.1064 2.2334 2.0156 5.7641 6.8783 12.5425 1.0833 1.0558 1.0860 1.0884 1.0928 1.0970 1.1130 1.1017
irintensity: 0.4505 0.4105 0.1212 4.8535 0.9472 1.6543 0.5923 11.6202 1.1290 2.1883 4.2296 5.6585 18.3001 28.0063 31.4208 0.0080 44.7275 20.5418 55.7939 16.4335 0.0056 33.9559 4.4794 30.6150 79.2417 58.3846 14.7503 0.8608 27.7365 1.6643 42.7260 16.9815 0.0247 0.7784 0.7827 28.4430 12.6944 3.9409 21.3081 3.5178 0.2329 7.3404 1.4746 3.8119 1.5313 6.2249 10.2230 16.6899 15.0737 3.9067 0.5592 0.6402 16.2020 6.0976 1.1447 7.5203 0.2140 4.4303 0.3773 27.0148
temp: 298.150 k
press: 1.00000 atm
elementType: 53 16 8 8 7 6 6 6 6 6 6 6 6 6 1 1 1 1 1 1 1 1
symmnumber: 1
zpe: 391041.5 jmol-1
zpe.correction: 0.148940 hartree
zpe.thermalcorrener: 0.163706 hartree
zpe.thermalcorrenthalpy: 0.164650 hartree
zpe.thermalcorrgfe: 0.102766 hartree
zpe.sumelectzpe: -961.315396 hartree
zpe.sumelectthermal: -961.300630 hartree
zpe.sumelectthermalent: -961.299686 hartree
zpe.sumelectthermalfe: -961.361570 hartree
dipole: 4.1965 -7.5013 -1.7803
dipole: 8.7778
quadrupole: -89.0757 -120.8753 -104.1230
quadrupole: -4.6086 -6.5457 -3.0587
quadrupole: 15.6156 -16.1840 0.5684 -4.6086 -6.5457 -3.0587
hfenergy: -961.4643359 hartree
pointgroup: C01 [X(C9H8I1N1O2S1)]
dipole: -2.5606361 -1.9333128 1.2774176 debye
dipolederiv: -0.3154282 0.2352449 -0.0571621 0.3072297 -0.4708973 0.1153986 -0.029277 0.1347073 -0.0318005 1.7927874 -0.0576513 0.0078836 -0.1217774 1.2105026 -0.1294015 0.1437927 -0.2220432 1.1562639 -0.7745393 0.0563668 0.0152485 0.0693311 -0.4765222 -0.0763121 -0.0409935 0.0855314 -0.6684706 -0.6881147 0.0041272 -0.0041678 0.1154872 -0.7168123 0.0678924 -0.0242662 -0.0715564 -0.4520883 -0.1533396 0.0059596 0.0186719 0.0380008 -0.0909943 0.0066095 -0.0074163 -0.0176122 -0.1787461 -0.1483536 0.030435 -0.0185936 -0.1438247 -0.1069524 0.0149723 0.0563712 0.1012428 -0.1140968 0.0104213 -0.0031756 -0.0122763 0.0552697 -0.1648995 0.0586378 -0.0979932 0.1005008 -0.1485529 0.5222363 -0.3352134 0.1162209 -0.2295014 0.7050255 -0.2038561 -0.1754005 -0.1416564 0.0993032 -0.2560339 0.110817 0.0831171 -0.1828232 -0.0373595 0.0823013 -0.1239466 -0.0242928 -0.089046 -0.271275 -0.0540458 -0.0848731 0.1374525 -0.0922051 -0.0373345 0.1720206 0.0595327 -0.0552566 -0.039745 -0.0883041 -0.1248896 -0.0040637 -0.0380464 0.0795077 -0.0352953 0.1074117 0.0079595 -0.0455409 0.1264728 0.0826738 0.0368245 0.0215985 0.1109242 0.0046474 0.0757548 -0.0466408 0.1218339 0.0670245 -0.0664531 0.0504816 -0.054939 0.0421529 -0.0622359 0.0415094 -0.0590622 -0.1192444 0.0137279 0.0064645 0.0081333 -0.159198 0.0228474 0.0103972 0.0526134 -0.0500519 0.0452543 0.0386304 -0.0363103 0.0718557 0.0284156 0.0057029 0.0007998 -0.0233631 0.015269 -0.018914 -0.0114768 -0.0286144 -0.0735756 0.0234039 0.0264169 0.0044992 0.0124568 0.0661163 0.1260633 -0.0068945 -0.0420189 -0.0092657 -0.0017336 0.0901706 0.0661894 -0.004532 0.0957376 0.1424248 -0.0676771 -0.0287925 -0.0339913 0.089171 -0.0498802 -0.0317039 -0.0153213 0.1275853 0.1395015 0.0282487 0.0608368 0.0342434 0.1099725 -0.0264887 0.0387871 -0.0496982 0.0900719 0.0085966 0.0253759 0.0771149 0.0201939 0.0733386 -0.0925838 0.0909279 -0.0945215 0.0398136 0.0064746 -0.0707849 -0.0177671 -0.0930009 0.0347341 -0.0912573 -0.0153513 -0.0908636 0.0793529 -0.0850656 -0.0472073 0.0536869 -0.0526795 0.1143974 -0.0164204 0.0554471 -0.0158006 0.1163395 unknown
polarizability: 209.9845976|-16.0251085|163.9455752|-2.9472676|2.4726442|106.8359206 unknown
InChI: InChI=1S/C9H8INO2S/c10-8(6-11)7-14(12,13)9-4-2-1-3-5-9/h1-5,8H,7H2
charge 0 multiplicity 1
22 atoms
I  3.625013 -2.720327 0.675005
S  0.288417 0.636404 -0.547807
O  0.560779 0.108447 -2.078327
O  0.56125 2.175841 -0.08033
N  4.476326 1.104406 -0.105766
C  1.404719 -0.575458 0.589338
C  -1.494153 0.189605 -0.08342
C  2.685432 -0.851161 -0.179661
C  -2.117814 0.952018 0.917169
C  -2.12355 -0.838719 -0.803382
C  -3.459716 0.635178 1.234243
C  -3.465504 -1.137959 -0.470632
C  -4.125125 -0.408057 0.547189
C  3.671493 0.222959 -0.131962
H  1.531976 -0.029845 1.534634
H  0.772887 -1.469587 0.691264
H  2.461062 -1.130643 -1.225749
H  -1.584986 1.776083 1.403483
H  -1.596967 -1.357649 -1.611557
H  -3.982927 1.207141 2.007307
H  -3.993932 -1.929834 -1.011279
H  -5.165376 -0.643743 0.795841
