program: Gaussian 09
title: 000220945
version: EM64L-G09RevD.01
frameworkgroup: C1[X(C8H13N)]
method: RPBEPBE
basis: SDD
operation: Freq
keyword: #pfreq=noraman
keyword: PBEPBE/SDD
title: #p freq=noraman PBEPBE/SDD
converged: NO NO NO NO
title: Mulliken charges:
elementType: N C C C C C C C C H H H H H H H H H H H H H
charge: -0.418424 0.176398 0.395233 -0.688953 -0.688943 -0.755710 -0.445201 -0.261532 -0.279221 0.201051 0.220460 0.218766 0.220469 0.201052 0.218760 0.226608 0.210495 0.210458 0.317507 0.240916 0.243082 0.236730
chargesum: 0.00000
title: Mulliken charges with hydrogens summed into heavy atoms:
elementType: N C C C C C C C C
charge: -0.100917 0.176398 0.395233 -0.048675 -0.048662 -0.108150 -0.204286 -0.018451 -0.042491
polarizability: 1.10555485e+02 -9.96036734e-01 9.03665541e+01 -5.22664332e-05 2.39335440e-04 6.45403723e+01
1716.lowfreq: -18.3157 -5.0092 -0.0008 -0.0007 -0.0004 7.5605 23.0861 137.4833 201.9061
frequency: -10.5005 137.4804 201.9053 203.5930 252.8064 292.4580 316.5880 320.5649 331.5958 418.0164 454.4193 567.2130 580.7867 616.5746 676.3750 703.0709 792.1162 813.7240 862.6992 874.8514 917.0732 925.2919 936.4919 941.9315 1013.9025 1026.6736 1038.3529 1080.4191 1125.9902 1165.1509 1209.7160 1213.5733 1262.2956 1289.9912 1369.1935 1374.4341 1392.9519 1401.2440 1414.4386 1455.5720 1460.3937 1463.7871 1468.5100 1476.2919 1487.6308 1497.7823 1556.0252 2961.7184 2966.4670 2971.5572 3053.0012 3060.9984 3064.3854 3073.0434 3075.7851 3081.0411 3193.3440 3209.9669 3236.2415 3600.7774
redmass: 3.2707 2.8513 2.4171 1.0574 1.1147 1.0336 2.5941 2.5524 2.6525 3.0436 2.9530 2.9122 1.4910 2.1132 2.4800 1.3520 1.3681 2.7999 1.3334 5.4165 1.7234 1.7147 2.6442 1.2060 1.4210 1.3748 1.3031 1.6518 1.4123 2.5604 3.0156 2.6342 1.6264 3.2840 1.2486 1.1916 2.4509 1.2680 3.5770 1.0501 2.9820 1.0485 1.1372 1.1251 1.0502 1.1125 3.5812 1.0357 1.0352 1.0361 1.1002 1.0996 1.0992 1.0976 1.1003 1.0992 1.0915 1.0964 1.1074 1.0803
irintensity: 1.0856 0.4681 0.8245 0.0104 0.0641 0.0979 0.3393 1.2909 0.1354 2.0989 1.5522 0.1662 45.7350 1.5594 0.0287 132.7331 37.0978 2.5454 0.0277 1.9665 2.0024 1.6375 16.5646 0.0003 3.9862 0.0044 23.4131 21.5133 19.5248 6.1523 9.9681 5.5438 0.9133 62.1900 22.2479 18.4600 10.7301 1.9153 7.3243 0.1267 0.7694 1.4155 0.8544 16.3213 11.3920 15.1459 12.3983 35.9207 32.6785 33.8759 28.2278 12.7558 17.4193 101.5970 21.8746 48.3355 8.2942 5.3816 4.2061 39.6099
temp: 298.150 k
press: 1.00000 atm
elementType: 7 6 6 6 6 6 6 6 6 1 1 1 1 1 1 1 1 1 1 1 1 1
symmnumber: 1
zpe: 502014.5 jmol-1
zpe.correction: 0.191207 hartree
zpe.thermalcorrener: 0.199970 hartree
zpe.thermalcorrenthalpy: 0.200915 hartree
zpe.thermalcorrgfe: 0.158608 hartree
zpe.sumelectzpe: -366.695931 hartree
zpe.sumelectthermal: -366.687167 hartree
zpe.sumelectthermalent: -366.686223 hartree
zpe.sumelectthermalfe: -366.728530 hartree
dipole: 1.1919 1.7347 0.0000
dipole: 2.1047
quadrupole: -54.7359 -49.9735 -59.9535
quadrupole: -1.8183 -0.0002 -0.0002
quadrupole: 0.1517 4.9141 -5.0658 -1.8183 -0.0002 -0.0002
hfenergy: -366.8871377 hartree
pointgroup: C01 [X(C8H13N1)]
dipole: -0.4808319 0.6741367 -0.0005929 debye
dipolederiv: -0.1630239 0.2200898 -0.0002022 0.2469531 -0.5285406 0.0003046 -0.0002731 0.0003122 -0.198137 0.2790731 -0.0099607 0.0000142 -0.0591119 0.1309158 0.0000736 -0.0000366 0.0000712 0.1856544 0.0675489 0.0105617 -0.0000127 -0.0744885 0.2651408 -0.0003948 0.0001825 -0.0004059 -0.1454089 -0.0195872 -0.0054103 0.0210303 0.0125721 0.0002907 0.0463071 -0.009254 0.0458258 -0.0225289 -0.0196678 -0.0054506 -0.0210264 0.0125842 0.0001683 -0.0463416 0.0092485 -0.0458512 -0.0224096 -0.0386834 0.0428114 -0.000026 0.0293065 -0.0603241 0.0000647 -0.0000091 0.0000551 0.060581 -0.1411453 0.0479301 -0.0000626 0.083663 -0.089167 -0.000169 -0.0001046 -0.0001763 -0.2546234 -0.0614908 -0.2481073 0.0002081 -0.2163492 0.1172274 -0.0003178 0.0001985 -0.0003183 -0.2436973 0.0168127 0.0286711 -0.0000613 0.0487287 -0.0544238 -0.0002148 -0.0000763 -0.0001985 -0.2563542 -0.248103 -0.0229384 0.0409872 -0.0095766 0.0910474 0.0137675 0.0120033 0.0131034 0.067761 0.0820274 0.0906872 -0.0020636 0.065534 -0.137122 0.034069 0.0014962 -0.0109517 0.0734451 0.0815025 -0.0438794 -0.072822 -0.0331472 0.0278027 -0.114097 -0.0493265 -0.0665846 -0.1075673 0.0820262 0.0906748 0.0019332 0.0655171 -0.1371491 -0.0338063 -0.0015795 0.0112224 0.0734778 -0.2481317 -0.0229814 -0.0409281 -0.0095946 0.0910132 -0.0137977 -0.011994 -0.0131361 0.0677922 0.0815104 -0.0437839 0.0728634 -0.0330752 0.028038 0.1139272 0.0493548 0.0664041 -0.1078201 -0.1895076 0.0411616 0.0000021 -0.0265851 0.0916866 0.0000065 0.0000507 -0.0000008 0.0984523 0.0798867 -0.0670539 -0.0826749 -0.0311617 -0.0157203 -0.0917728 -0.0675988 -0.119934 -0.0859 0.0799071 -0.0669443 0.0827462 -0.0310647 -0.0154642 0.0916982 0.0676178 0.1198659 -0.0862239 0.2417026 0.033895 -0.0000395 0.033112 0.1756921 0.0000976 -0.0000269 0.0001081 0.2800027 0.0848541 -0.0851149 0.0000978 -0.074192 -0.0480062 0.0002406 0.0000802 0.0002396 0.1895135 0.0125156 -0.067195 0.0000893 -0.0885625 0.0019295 0.0002345 0.0001047 0.000225 0.234962 -0.0600267 0.0823376 -0.0000525 0.0889383 0.0649645 0.0001208 -0.0000579 0.0001247 0.1990287 unknown
polarizability: 110.5142909|1.3498285|90.4077233|-0.005767|-0.0252231|64.5403973 unknown
InChI: InChI=1S/C8H13N/c1-8(2,3)7-5-4-6-9-7/h4-6,9H,1-3H3
charge 0 multiplicity 1
22 atoms
N  0.97961 1.110073 -0.001077
C  -1.345584 -0.004093 0.000206
C  0.18259 -0.041294 0.000135
C  -1.877711 -0.731763 1.269378
C  -1.877879 -0.73338 -1.267976
C  -1.872706 1.45719 -0.000677
C  1.062222 -1.138357 0.001088
C  2.334503 0.765393 -0.000899
C  2.410544 -0.633039 0.000453
H  -2.985016 -0.742357 1.277089
H  -1.523545 -1.777883 1.301443
H  -1.525543 -0.229322 2.1890
H  -1.523759 -1.779559 -1.298709
H  -2.985187 -0.743938 -1.275572
H  -1.52578 -0.232158 -2.18829
H  -2.977761 1.457293 -0.000551
H  -1.544159 2.011721 0.900109
H  -1.544384 2.010554 -0.902264
H  0.618986 2.062373 -0.001937
H  0.768308 -2.18812 0.002131
H  3.116752 1.522029 -0.001712
H  3.3268 -1.222762 0.00093
