program: Gaussian 09
title: 000220916
version: EM64L-G09RevD.01
frameworkgroup: C1[X(C11H10ClN3O)]
method: RPBEPBE
basis: SDD
operation: Freq
keyword: #p
keyword: freq=noraman
keyword: PBEPBE/SDD
title: #p freq=noraman PBEPBE/SDD
converged: YES YES NO NO
title: Mulliken charges:
elementType: Cl O N N N C C C C C C C C C C C H H H H H H H H H H
charge: -0.037938 -0.260262 -0.296526 -0.079823 0.044224 0.360510 -0.229988 0.434179 0.181207 -0.768438 -0.330017 -0.354657 -0.747722 -0.201332 -0.186600 -0.122349 0.244530 0.249322 0.289303 0.263625 0.287179 0.248279 0.239568 0.249346 0.261521 0.262859
chargesum: 0.00000
title: Mulliken charges with hydrogens summed into heavy atoms:
elementType: Cl O N N N C C C C C C C C C C C
charge: -0.037938 -0.260262 -0.296526 -0.079823 0.044224 0.360510 -0.229988 0.434179 0.181207 0.014718 -0.066392 -0.067478 -0.010528 0.060189 0.076258 -0.122349
polarizability: 2.77171582e+02 8.87836287e+00 1.51266742e+02 2.47321462e-01 -9.17700726e+00 7.58643240e+01
1716.lowfreq: -4.5604 -0.0028 -0.0027 -0.0022 2.1381 6.2577 43.9766 47.4921 72.5794
frequency: 43.9674 47.4854 72.5783 82.5754 123.3234 151.3513 164.7031 179.7615 196.6905 237.4526 252.1119 273.7791 294.1607 317.2733 334.8060 406.3086 414.6767 438.6362 495.6365 509.5605 552.2787 606.6152 619.8522 646.5016 698.5138 703.4870 708.7909 727.0038 821.8614 831.6635 835.4851 948.4242 960.9524 969.6225 996.8373 1016.3506 1027.8451 1036.3990 1046.5231 1059.1287 1075.5486 1116.8987 1180.1438 1189.4974 1272.1119 1293.8382 1298.5359 1372.3227 1385.9743 1398.7056 1401.2449 1407.6677 1423.4751 1439.3749 1453.9540 1457.5004 1475.2388 1477.4109 1499.4636 1515.7226 1588.0676 1600.9598 2984.9978 2999.9391 3067.2337 3082.5908 3112.7248 3116.3880 3164.6356 3168.3139 3184.2216 3190.9098
redmass: 5.4798 4.8557 7.4582 1.0377 3.2883 7.0709 1.8791 4.9073 2.5125 6.2820 4.5661 4.6595 4.6239 4.0584 4.0947 4.9733 3.1824 7.0892 4.9094 4.2371 4.4398 4.4784 7.0516 6.9644 4.7596 4.2146 7.3259 6.2911 1.2606 1.5738 3.7993 1.3204 1.7005 1.8244 3.8835 2.9883 2.1961 1.5727 1.5441 3.3731 2.7109 1.3239 1.7599 1.9205 5.4002 3.2541 1.7955 6.2232 4.3484 1.3150 2.6051 1.3847 2.5927 1.3479 1.5655 1.2772 1.7680 1.2291 3.5033 3.6515 8.0286 6.3012 1.0405 1.0367 1.0924 1.0971 1.0999 1.1005 1.0891 1.0901 1.0966 1.0968
irintensity: 0.6785 1.1182 1.8364 1.0599 2.0893 1.5860 3.6306 1.6146 2.0394 1.6228 2.0771 2.5389 2.4417 2.0175 0.5693 4.0225 0.4936 11.1433 11.1244 17.4647 11.4968 7.1628 0.3266 4.0307 0.8799 4.4654 7.7116 25.1629 8.2813 61.2916 10.6316 0.2069 0.5948 1.2460 60.2009 12.7062 0.1462 2.6570 6.0506 55.3187 47.8086 17.0178 1.6031 4.6295 50.0234 278.2369 76.7523 0.1738 49.0701 41.4560 2.6891 23.8914 98.9580 9.5407 4.0113 18.8580 129.9998 13.3293 60.7314 84.8058 0.7867 1.9924 7.6015 11.4296 8.0918 8.8941 2.0403 8.8330 2.3008 1.8729 2.4071 0.1171
temp: 298.150 k
press: 1.00000 atm
elementType: 17 8 7 7 7 6 6 6 6 6 6 6 6 6 6 6 1 1 1 1 1 1 1 1 1 1
symmnumber: 1
zpe: 497925.2 jmol-1
zpe.correction: 0.189650 hartree
zpe.thermalcorrener: 0.204614 hartree
zpe.thermalcorrenthalpy: 0.205559 hartree
zpe.thermalcorrgfe: 0.146633 hartree
zpe.sumelectzpe: -1123.491160 hartree
zpe.sumelectthermal: -1123.476195 hartree
zpe.sumelectthermalent: -1123.475251 hartree
zpe.sumelectthermalfe: -1123.534176 hartree
dipole: 2.9809 0.2878 -0.0045
dipole: 2.9948
quadrupole: -128.1288 -93.1797 -98.9901
quadrupole: -10.8030 -1.4228 -4.3522
quadrupole: -21.3626 13.5865 7.7761 -10.8030 -1.4228 -4.3522
hfenergy: -1123.6808093 hartree
pointgroup: C01 [X(C11H10Cl1N3O1)]
dipole: 1.1731069 -0.1098395 0.0033502 debye
dipolederiv: -1.0152822 -0.009954 -0.0081649 -0.0436767 -0.1026952 0.0230313 -0.0156269 0.0212307 -0.0680049 -0.5370849 -0.0060587 0.002871 1.0821212 -0.7904481 -0.0744716 0.0971637 -0.0512801 -0.1776576 -0.8533586 0.0495414 0.0016283 0.3498185 -0.3453068 0.0015942 0.0794056 -0.0195904 -0.026064 -0.4882273 0.1224001 0.029881 0.1673001 -0.0907206 0.0077825 -0.0849596 -0.0198265 -0.2063928 1.1738434 -0.3927577 -0.0711255 -1.1837999 0.583282 0.0772052 -0.1692736 0.0724637 -0.1672271 1.0098622 -0.1535235 -0.0247163 -0.2039712 0.1930068 0.0400508 0.0143023 0.035481 0.0836986 -1.4627034 0.3478684 0.0656084 -0.1687131 -0.3225255 -0.0519523 -0.0071212 -0.0598196 0.0281123 0.913374 0.0439679 -0.0051336 0.0179334 -0.0138505 -0.0435476 0.0021467 -0.012783 0.0462169 0.3129832 0.0859423 -0.0044456 0.1179789 0.637271 0.0746563 0.0565904 0.071462 0.0443923 -0.0115687 0.0131647 0.0213783 -0.0166773 -0.212045 -0.0428734 0.0802411 -0.0334574 0.0563995 -0.0279175 -0.0282749 0.0182899 0.0336467 -0.0501179 -0.0570171 -0.0120958 -0.0662904 -0.0960204 -0.0709799 0.0454117 -0.0036954 0.0123262 0.0199329 -0.0518741 0.0251414 -0.0264797 -0.096741 -0.1188528 -0.1751116 -0.0203049 -0.101938 -0.0474996 -0.012099 0.0050707 -0.0152599 0.0369392 -0.3957852 0.0624264 -0.0230497 0.1259379 -0.014467 -0.053234 -0.0999362 -0.0357644 -0.0705638 -0.3291355 -0.0818399 0.0365907 -0.1376567 0.0104836 -0.0523814 0.0860936 -0.0552258 -0.0709508 1.4073388 0.0367112 0.0192515 0.0309235 0.0749524 -0.0632168 0.0475376 -0.0682253 -0.0357805 -0.0159336 -0.0710296 -0.0983966 -0.0395276 0.0770205 0.0105285 -0.1057672 -0.0078677 0.0652312 0.1142392 -0.044743 0.0096791 -0.0283665 0.0273196 0.0404259 0.0119667 0.0771584 -0.0364546 0.019162 0.0605036 0.0818982 -0.0212407 0.108723 -0.0138537 0.0224497 -0.0321514 0.0820187 0.0430431 0.0655535 -0.0517297 0.0609548 0.0356433 0.0635647 -0.0577545 0.0617219 0.1156841 0.1085844 -0.0523068 0.0263055 -0.0518643 0.0680394 0.0535992 0.0390552 0.0394477 0.1402058 0.0452886 -0.0225182 -0.0880847 -0.0040113 0.0645345 0.0433341 -0.1023582 -0.0058578 -0.0184415 0.0607001 0.12935 0.007142 0.0247095 -0.0610091 -0.0144572 -0.0006007 -0.0082188 0.1188605 0.0329785 -0.0332335 0.0859403 -0.0214142 0.0691008 -0.0325197 0.0989387 0.0183594 -0.0095869 0.046857 -0.0456824 0.0235654 -0.0539433 0.0383292 0.066817 0.0239493 0.0637218 0.1301674 0.0385752 0.0541929 -0.0311827 0.0531501 0.0430464 0.0609082 -0.0345591 0.0570518 0.1319594 unknown
polarizability: 277.2213463|-8.5167041|151.0159403|-0.0565089|-9.97029|76.0653609 unknown
InChI: InChI=1S/C11H10ClN3O/c1-7-11(14-16)8(2)15(13-7)10-5-3-9(12)4-6-10/h3-6H,1-2H3
charge 0 multiplicity 1
26 atoms
Cl 5.649243 0.098604 0.021347
O  -4.09883 1.834534 0.174683
N  -0.397206 -0.199065 -0.049666
N  -0.958262 -1.512609 -0.175555
N  -3.942162 0.545873 0.079991
C  -1.358438 0.782495 0.072478
C  -2.607929 0.089575 -0.002108
C  1.032787 -0.102343 -0.036977
C  -2.2951 -1.316782 -0.150657
C  -1.108603 2.236759 0.329652
C  1.697369 1.01554 -0.598496
C  1.77887 -1.174407 0.512228
C  -3.252549 -2.462831 -0.275361
C  3.106598 1.080726 -0.576113
C  3.186104 -1.115197 0.530136
C  3.83256 0.016788 -0.006863
H  -0.1488 2.407912 0.845363
H  -1.109671 2.820603 -0.611028
H  -1.940809 2.635277 0.930708
H  1.134137 1.817633 -1.081734
H  1.249429 -2.044577 0.906638
H  -3.880978 -2.3515 -1.176516
H  -2.700955 -3.414399 -0.33762
H  -3.93852 -2.493243 0.589047
H  3.627496 1.938207 -1.010965
H  3.769219 -1.936268 0.95629
