program: Gaussian 09
title: 000220878
version: EM64L-G09RevD.01
frameworkgroup: C1[X(C5H13NO)]
method: RPBEPBE
basis: SDD
operation: Freq
keyword: #p
keyword: freq=noraman
keyword: PBEPBE/SDD
title: #p freq=noraman PBEPBE/SDD
converged: YES YES NO NO
title: Mulliken charges:
elementType: O N C C C C C H H H H H H H H H H H H H
charge: -0.465044 -0.582860 0.325414 -0.136946 -0.727427 -0.747695 -0.715993 0.194547 0.187609 0.256242 0.222743 0.207966 0.230759 0.235407 0.207333 0.245147 0.205464 0.261856 0.273074 0.322404
chargesum: 0.00000
title: Mulliken charges with hydrogens summed into heavy atoms:
elementType: O N C C C C C
charge: -0.142639 -0.047930 0.325414 0.057601 -0.060833 -0.073563 -0.058050
polarizability: 6.69397498e+01 2.30724296e-01 6.54299477e+01 -4.62485376e-01 3.81859818e-01 6.44008382e+01
1716.lowfreq: -28.3589 -9.7319 -0.0011 -0.0009 -0.0006 19.1824 89.4581 163.1285 198.5744
frequency: 89.4430 163.0833 198.5161 220.2403 246.1701 261.1861 282.1471 298.9484 336.5115 348.6719 401.8248 438.7669 479.4229 535.3787 648.3526 695.9170 826.3724 900.0554 926.2739 942.5613 975.9667 997.9765 1072.9864 1075.0778 1129.5460 1169.7525 1192.6477 1227.4796 1286.6837 1338.4582 1366.3089 1373.3046 1376.1316 1391.6681 1454.3885 1461.8208 1466.0857 1479.6412 1483.8117 1495.8614 1641.0376 2962.1789 2968.5757 2976.8846 2995.4572 3062.5635 3068.1441 3089.0946 3093.5043 3098.6629 3106.2048 3440.2888 3544.2901 3565.6940
redmass: 2.6202 1.0834 1.0542 1.1818 1.9998 1.6520 1.4842 1.1764 2.6301 2.3245 2.5874 2.2103 3.5979 2.4493 1.5257 2.9415 2.6909 1.9673 1.4657 1.7943 1.2410 1.3081 1.5434 2.6322 1.9162 1.8492 1.9121 2.2287 1.6391 1.4544 1.2447 1.3921 1.2224 1.3374 1.0596 1.0644 1.0506 1.0620 1.0477 1.0549 1.0911 1.0756 1.0489 1.0356 1.0356 1.0934 1.0989 1.0990 1.0995 1.0996 1.0994 1.0452 1.0656 1.0964
irintensity: 0.8228 49.5592 5.1401 3.9474 16.9001 0.6113 3.0355 121.5753 2.5314 2.6356 12.9518 4.3363 8.6183 1.6688 202.2586 9.3621 10.9756 18.0169 3.2596 10.9023 3.1638 6.6034 22.3214 21.3625 116.1054 1.8415 20.0808 14.5556 6.5593 2.5150 12.2515 35.5021 20.4615 27.9398 1.3250 7.2847 8.7661 1.5575 22.2350 5.0084 41.6210 10.7968 62.4592 27.3734 14.4673 21.3824 69.1925 17.6769 21.3080 29.0525 21.9353 1.4573 4.1114 0.6117
temp: 298.150 k
press: 1.00000 atm
elementType: 8 7 6 6 6 6 6 1 1 1 1 1 1 1 1 1 1 1 1 1
symmnumber: 1
zpe: 464557.9 jmol-1
zpe.correction: 0.176941 hartree
zpe.thermalcorrener: 0.186594 hartree
zpe.thermalcorrenthalpy: 0.187538 hartree
zpe.thermalcorrgfe: 0.144018 hartree
zpe.sumelectzpe: -327.686343 hartree
zpe.sumelectthermal: -327.676689 hartree
zpe.sumelectthermalent: -327.675745 hartree
zpe.sumelectthermalfe: -327.719265 hartree
dipole: -1.6062 0.9626 -0.8447
dipole: 2.0543
quadrupole: -43.0135 -50.5572 -40.3410
quadrupole: -0.1278 -1.2860 1.3809
quadrupole: 1.6237 -5.9200 4.2962 -0.1278 -1.2860 1.3809
hfenergy: -327.8632834 hartree
pointgroup: C01 [X(C5H13N1O1)]
dipole: 0.6425812 -0.3966183 -0.2880844 debye
dipolederiv: -0.7195853 0.0749575 -0.0964528 0.0567445 -0.670323 0.2397205 -0.0482306 0.250044 -0.2880637 -0.5194534 -0.0830047 -0.0541851 -0.0654211 -0.8096852 0.0991654 -0.036494 0.1269566 -0.1988223 0.4642934 -0.0257647 0.0830046 -0.0857544 0.4686079 -0.1210562 0.0698294 -0.142294 0.4116234 0.319654 -0.0832394 0.0584151 -0.0491013 0.4639893 -0.0298706 0.0862544 -0.0843789 0.17256 -0.1024047 -0.1186022 -0.0589115 -0.0286167 -0.157689 0.0061163 -0.0548965 -0.0589141 0.0274058 -0.0229849 0.0039871 0.0439216 0.0096882 0.0231986 -0.0685326 0.0185267 -0.0029547 -0.1476604 -0.105605 -0.1240187 -0.0398331 -0.0293896 -0.1847865 0.0151928 -0.0296797 -0.018516 0.0821039 0.024542 0.012856 -0.016199 0.0093499 0.0003073 -0.0543081 -0.0085271 -0.0385216 -0.2042681 0.0821138 -0.018682 0.0425308 -0.011603 0.0635023 0.0103315 -0.0055054 -0.0390222 -0.2057363 0.1342634 0.0716474 -0.0208805 0.039774 -0.0515667 0.0562049 -0.0126809 0.0830727 0.0657963 -0.1722148 -0.0189634 0.0453077 0.0255518 0.0797183 -0.0173305 0.07298 -0.0153468 0.0722702 0.0702635 0.0734268 -0.069074 0.0628263 -0.0548873 0.112819 -0.0542339 0.0755704 0.025892 -0.1493464 0.019784 0.0875396 0.009919 0.1025254 -0.0065851 0.0404446 -0.0027283 0.0754085 0.0509575 -0.1099235 -0.0605343 -0.0963796 -0.0661084 -0.0824873 -0.0490336 -0.0573534 0.049156 0.0920563 -0.0123131 -0.0096925 -0.0092353 0.0624564 0.010691 -0.0499156 -0.0395786 -0.169236 0.1112623 0.098984 -0.037757 0.0539983 -0.0900233 0.0643399 -0.0270562 0.0654491 0.0631557 -0.1719978 -0.0242804 0.0924867 0.0145463 0.0747826 -0.0279431 0.1121969 -0.0091615 0.0362554 0.2276576 0.0724161 -0.0967321 0.0336303 0.2084333 -0.1124843 -0.0817776 -0.0322417 0.0307968 0.0214146 0.1686011 0.06645 0.0463084 0.2755212 0.0395985 0.068869 0.0197749 0.1240456 0.365114 0.0221322 0.0405958 0.013164 0.2620268 -0.1335821 -0.0110698 -0.0798561 -0.0226825 unknown
polarizability: 66.9122218|0.2895359|65.3724381|0.5059686|-0.4433222|64.4858757 unknown
InChI: InChI=1S/C5H13NO/c1-4(6)5(2,3)7/h4,7H,6H2,1-3H3
charge 0 multiplicity 1
20 atoms
O  -1.150583 1.291767 -0.608575
N  1.459869 -1.336393 0.238237
C  -0.617293 0.04637 0.017986
C  0.894958 -0.108662 -0.38091
C  -1.428973 -1.165719 -0.480555
C  -0.811471 0.27011 1.526055
C  1.724979 1.167026 -0.089202
H  0.90197 -0.283536 -1.478349
H  -1.369667 -1.252783 -1.584639
H  -1.02109 -2.096325 -0.052973
H  -2.491181 -1.05842 -0.197754
H  -0.427153 -0.590238 2.101944
H  -1.886186 0.384577 1.747961
H  -0.299782 1.189726 1.856979
H  1.874988 1.297727 0.999487
H  1.215367 2.068708 -0.471472
H  2.723365 1.091732 -0.558723
H  1.711643 -1.203091 1.224794
H  2.242771 -1.738339 -0.287466
H  -1.243233 1.13116 -1.583026
