program: Gaussian 09
title: 000018772
version: EM64L-G09RevD.01
frameworkgroup: C1[X(C12H17NO2)]
method: RPBEPBE
basis: SDD
operation: Freq
keyword: #p
keyword: freq=noraman
keyword: PBEPBE/SDD
title: #p freq=noraman PBEPBE/SDD
converged: YES YES NO NO
title: Mulliken charges:
elementType: O O N C C C C C C C C C C C C H H H H H H H H H H H H H H H H H
charge: -0.329186 -0.379933 -0.312407 -0.025914 -0.587174 0.492178 -0.703714 -0.702086 -0.397735 -0.395055 0.465714 -0.450537 -0.375525 -0.645684 0.301880 0.200174 0.208710 0.207381 0.229893 0.203525 0.212625 0.211763 0.232471 0.204836 0.232525 0.233453 0.223403 0.269196 0.255374 0.207543 0.333903 0.378401
chargesum: 0.00000
title: Mulliken charges with hydrogens summed into heavy atoms:
elementType: O O N C C C C C C C C C C C C
charge: -0.329186 -0.001532 0.021496 0.174260 -0.171082 0.492178 -0.057671 -0.053016 -0.165210 -0.161602 0.465714 -0.227134 -0.106330 -0.182766 0.301880
polarizability: 1.83289730e+02 2.86769134e+00 1.15267872e+02 3.35249293e+00 -1.24254427e+01 1.32788346e+02
1716.lowfreq: -18.1493 -5.8289 -2.4930 0.0006 0.0009 0.0010 16.9264 24.6156 38.4742
frequency: 15.9199 24.5882 38.4117 56.5187 80.6671 104.6982 161.0672 204.5434 211.0695 230.1888 239.3701 258.2009 316.1931 322.7727 355.5392 367.2333 382.7720 391.4970 408.7034 451.5352 472.6082 498.2111 589.7903 615.5435 639.1699 706.0961 718.0459 772.1177 797.9442 821.8001 844.4137 858.5337 880.3585 899.4526 920.3818 943.8068 951.0008 961.6227 962.3018 980.8694 1011.7686 1015.5612 1076.7980 1086.8976 1120.4411 1140.2103 1180.0427 1193.5487 1204.7784 1220.4610 1225.6689 1244.1956 1269.7500 1285.1269 1318.2978 1331.1124 1348.0640 1358.1207 1376.8150 1383.0509 1393.8368 1412.2494 1448.3350 1464.9111 1466.7439 1472.7302 1483.2854 1487.1662 1495.0640 1505.3734 1570.7162 1581.6064 1622.1200 2957.2477 2968.9619 2971.7635 2980.8276 2994.4056 3031.5817 3052.7807 3062.2317 3066.8348 3069.1477 3075.8282 3108.4915 3122.6290 3134.4963 3150.8759 3234.4699 3617.0348
redmass: 3.4896 6.1070 3.7007 4.8326 2.7672 4.8748 4.9659 4.1575 1.3413 3.3446 1.0583 3.6062 3.3141 3.3680 1.7976 2.1816 2.1215 1.7917 2.8129 2.6868 2.8925 1.1851 2.5735 3.7658 5.7812 3.8103 3.6489 3.5232 3.1918 2.7561 1.8266 1.4082 1.5542 2.3463 1.2238 3.2564 1.7393 1.6361 1.6097 1.3770 4.2243 3.1802 1.6587 1.4977 1.3703 1.2023 2.0905 1.1499 2.5785 2.5569 1.2524 1.2602 1.4834 1.5282 1.3681 1.4450 1.3790 2.2671 1.2250 5.3809 1.2181 2.5579 1.1000 1.0444 1.0942 1.0552 1.0542 1.0559 1.9327 2.5773 3.9801 6.0428 6.3709 1.0780 1.0351 1.0386 1.0625 1.0592 1.1022 1.1016 1.0997 1.0986 1.1001 1.0991 1.0871 1.0886 1.0960 1.0964 1.0633 1.0830
irintensity: 1.2866 1.1503 1.4682 3.4355 0.3359 2.4666 0.8786 11.8910 3.6008 2.9544 1.9301 15.7861 5.6740 6.4111 81.8388 3.7123 21.3125 2.6795 0.0736 27.6881 13.7587 177.3993 23.8588 1.4020 0.2695 2.1318 23.0944 3.9207 4.6898 8.7567 19.1371 17.0158 2.4577 20.1722 3.0194 14.2432 1.1182 0.2438 0.3816 0.2340 83.7534 4.8166 0.8951 3.8881 2.9507 16.3745 4.5026 0.7263 5.4298 4.5395 0.8849 18.5982 19.9190 1.2483 1.9052 4.8448 10.9750 193.7133 23.3381 4.5644 14.7407 6.8547 15.3374 4.1636 3.7487 0.1537 20.3490 17.8181 74.0833 33.4483 87.9076 5.7049 1.4627 19.6656 42.7274 29.7210 59.8325 22.9600 19.7757 10.6286 23.6562 61.2302 5.3659 100.4635 14.6559 16.8707 23.5215 2.7444 26.5439 61.8916
temp: 298.150 k
press: 1.00000 atm
elementType: 8 8 7 6 6 6 6 6 6 6 6 6 6 6 6 1 1 1 1 1 1 1 1 1 1 1 1 1 1 1 1 1
symmnumber: 1
zpe: 698918.3 jmol-1
zpe.correction: 0.266204 hartree
zpe.thermalcorrener: 0.282224 hartree
zpe.thermalcorrenthalpy: 0.283168 hartree
zpe.thermalcorrgfe: 0.220437 hartree
zpe.sumelectzpe: -671.498353 hartree
zpe.sumelectthermal: -671.482333 hartree
zpe.sumelectthermalent: -671.481389 hartree
zpe.sumelectthermalfe: -671.544121 hartree
dipole: -1.7031 -1.8587 2.2724
dipole: 3.3940
quadrupole: -91.4839 -92.1528 -87.8986
quadrupole: -7.9930 7.0458 -4.4297
quadrupole: -0.9721 -1.6411 2.6132 -7.9930 7.0458 -4.4297
hfenergy: -671.7645571 hartree
pointgroup: C01 [X(C12H17N1O2)]
dipole: 0.611148 0.118965 1.1812414 debye
polarizability: 183.5448145|-0.4757226|108.7280333|1.0916914|-1.9511177|139.0730996 unknown
InChI: InChI=1S/C12H17NO2/c1-9(2)7-10-3-5-11(6-4-10)8-12(14)13-15/h3-6,9,13,15H,7-8H2,1-2H3
charge 0 multiplicity 1
32 atoms
O  -3.347857 0.367955 -1.662658
O  -4.658768 -1.652661 -0.554644
N  -3.955723 -0.694657 0.257373
C  3.866113 -0.912887 -0.095607
C  3.376141 0.564773 0.091035
C  1.868491 0.746443 0.195032
C  3.502323 -1.807794 1.111922
C  3.36082 -1.535647 -1.417759
C  1.208801 0.709272 1.450519
C  1.071567 0.96023 -0.961646
C  -0.977001 1.076452 0.385571
C  -0.191987 0.868448 1.545534
C  -0.32697 1.122586 -0.874134
C  -2.489959 1.27374 0.49641
C  -3.276415 0.308861 -0.383645
H  4.974197 -0.8537 -0.150937
H  3.758982 1.156769 -0.763653
H  3.858759 0.967605 1.003525
H  2.406463 -1.914557 1.210017
H  3.890762 -1.385982 2.058578
H  3.931396 -2.819744 0.989852
H  3.783325 -2.548086 -1.558104
H  2.259154 -1.625652 -1.418796
H  3.653308 -0.922085 -2.291072
H  1.798996 0.562155 2.363278
H  1.557291 1.008523 -1.943845
H  -0.673377 0.841946 2.531559
H  -0.924306 1.276309 -1.779755
H  -2.767868 2.291822 0.163621
H  -2.806602 1.178573 1.55181
H  -3.952753 -0.953358 1.241966
H  -4.468102 -1.282152 -1.479046
