program: Gaussian 09
title: 000220876
version: EM64L-G09RevD.01
frameworkgroup: C1[X(C12H11NO3)]
method: RPBEPBE
basis: SDD
operation: Freq
keyword: #p
keyword: freq=noraman
keyword: PBEPBE/SDD
title: #p freq=noraman PBEPBE/SDD
converged: YES YES NO NO
title: Mulliken charges:
elementType: O O O N C C C C C C C C C C C C H H H H H H H H H H H
charge: -0.231607 -0.224074 -0.292316 -0.389023 0.186497 0.296948 0.111256 0.070428 -0.340094 -0.361240 -0.374386 -0.251158 -0.207595 0.180955 -0.258832 -0.670027 0.323011 0.294404 0.285349 0.229846 0.236531 0.234010 0.229315 0.225469 0.213297 0.236528 0.246509
chargesum: 0.00000
title: Mulliken charges with hydrogens summed into heavy atoms:
elementType: O O O N C C C C C C C C C C C C
charge: -0.231607 -0.224074 -0.292316 -0.066012 0.186497 0.296948 0.111256 0.070428 -0.045690 -0.075891 -0.144539 -0.014628 0.026415 0.180955 0.195951 0.026306
polarizability: 2.35630732e+02 1.23923279e+00 1.54411353e+02 4.67088602e+00 2.63632290e+00 6.88252402e+01
1716.lowfreq: -7.6145 -1.7081 -0.0004 -0.0004 0.0002 7.0034 13.6816 38.9390 66.9911
frequency: 12.6051 38.8800 66.9883 86.1551 123.8678 133.6901 213.4965 224.0526 254.0836 285.3192 296.0062 318.3956 373.7183 411.6869 431.1376 479.2430 484.1226 522.9212 554.4894 571.4838 626.4656 633.6445 666.6767 708.4394 731.3906 749.4011 772.6131 809.8971 811.2734 822.0781 863.7387 879.0271 899.8970 962.5554 969.6951 1004.1612 1006.5934 1028.3619 1077.5515 1094.9197 1113.5936 1155.6971 1164.1575 1169.6150 1210.9851 1265.4812 1277.8107 1279.1934 1293.3958 1348.0469 1362.8742 1389.7208 1401.9866 1424.7271 1454.2024 1462.2266 1472.2034 1485.3462 1511.3919 1554.2481 1561.8272 1588.5704 1619.8547 1632.5071 2992.6500 3029.4185 3088.1904 3095.4047 3120.5830 3121.1254 3142.5001 3155.8424 3161.8974 3170.9860 3553.6324
redmass: 4.8563 3.8873 6.2990 4.0950 3.2607 4.4921 1.2617 4.4858 5.6822 4.2595 4.1201 5.7686 7.7176 3.2063 3.8466 7.4439 3.8998 5.1395 3.4845 7.4342 6.5304 1.2127 5.2516 4.8427 4.9779 4.1275 1.4716 3.8101 1.4665 3.1713 5.0046 1.5549 5.2893 1.3762 1.3674 2.6849 1.3372 2.1862 3.8427 2.1541 2.7174 1.7147 1.6060 1.1616 2.3261 1.6424 1.1684 2.5315 2.0380 1.7703 1.8872 1.2368 8.5563 2.1497 1.1231 1.0444 2.7042 1.0521 2.9890 9.1685 6.8338 4.5947 7.0539 6.6055 1.0362 1.0598 1.0973 1.1025 1.0887 1.1061 1.0884 1.0935 1.0939 1.1002 1.0781
irintensity: 5.6051 1.8149 1.4088 0.3329 2.1959 2.5869 1.9891 6.3316 2.0261 2.2365 4.4036 18.9427 3.2531 7.1072 7.6212 1.8092 0.8544 4.0395 8.1498 3.9563 7.4403 86.1933 0.3044 1.6585 15.8549 6.0939 112.4009 0.0732 3.6085 3.0550 2.7997 0.2835 26.7364 8.9171 1.9380 34.2447 0.8007 6.0445 129.2824 38.5819 208.1086 72.1987 19.8425 2.7172 1.5909 9.0298 34.8488 181.2145 44.2214 2.8041 23.6304 22.9948 12.8491 6.7174 39.8271 16.5164 84.6859 15.1848 130.8538 91.3934 240.9114 61.9803 147.5168 156.5275 24.6380 37.0659 40.9045 2.2782 7.0302 29.2240 10.2552 5.3060 2.4686 27.1995 65.4638
temp: 298.150 k
press: 1.00000 atm
elementType: 8 8 8 7 6 6 6 6 6 6 6 6 6 6 6 6 1 1 1 1 1 1 1 1 1 1 1
symmnumber: 1
zpe: 543299.7 jmol-1
zpe.correction: 0.206932 hartree
zpe.thermalcorrener: 0.220905 hartree
zpe.thermalcorrenthalpy: 0.221849 hartree
zpe.thermalcorrgfe: 0.164108 hartree
zpe.sumelectzpe: -743.179747 hartree
zpe.sumelectthermal: -743.165773 hartree
zpe.sumelectthermalent: -743.164829 hartree
zpe.sumelectthermalfe: -743.222570 hartree
dipole: 3.8903 3.5425 0.2645
dipole: 5.2682
quadrupole: -70.5026 -87.3594 -95.1660
quadrupole: 9.9343 1.3345 -0.0656
quadrupole: 13.8400 -3.0167 -10.8233 9.9343 1.3345 -0.0656
hfenergy: -743.3866784 hartree
pointgroup: C01 [X(C12H11N1O3)]
dipole: -1.5040793 1.3678073 -0.4035203 debye
polarizability: 235.6709771|-3.0446387|148.1289743|0.1670202|-22.6441943|75.0673739 unknown
InChI: InChI=1S/C12H11NO3/c1-2-16-12(15)9-7-13-10-6-4-3-5-8(10)11(9)14/h3-7,13H,2H2,1H3
charge 0 multiplicity 1
27 atoms
O  2.848137 -0.660615 0.443223
O  0.377944 -1.930948 0.530803
O  2.909705 1.48082 -0.471931
N  -1.207962 1.771521 -0.523938
C  -1.549382 -0.542272 0.135923
C  -2.097694 0.719899 -0.234089
C  0.761296 0.412229 -0.087828
C  -0.06562 -0.77897 0.223139
C  0.150104 1.610677 -0.450443
C  -2.443933 -1.604955 0.425641
C  -3.501303 0.916705 -0.312805
C  -3.834932 -1.42021 0.351306
C  -4.363524 -0.153556 -0.019684
C  2.252066 0.475114 -0.073235
C  4.344265 -0.677029 0.456817
C  4.886824 -1.169877 -0.88806
H  -1.592405 2.678634 -0.792855
H  0.776164 2.474859 -0.693776
H  -2.000331 -2.566138 0.705703
H  -3.906379 1.895012 -0.59982
H  -4.5139 -2.2486 0.57769
H  -5.447485 -0.007691 -0.078388
H  4.710927 0.337518 0.69275
H  4.579287 -1.373498 1.277079
H  5.985476 -1.283545 -0.828671
H  4.44954 -2.149165 -1.147227
H  4.656715 -0.44982 -1.691123
