program: Gaussian 09
title: 000220874
version: EM64L-G09RevD.01
frameworkgroup: C1[X(C11H13NO4)]
method: RPBEPBE
basis: SDD
operation: Freq
keyword: #p
keyword: freq=noraman
keyword: PBEPBE/SDD
title: #p freq=noraman PBEPBE/SDD
converged: YES YES NO NO
title: Mulliken charges:
elementType: O O O O N C C C C C C C C C C C H H H H H H H H H H H H H
charge: -0.308188 -0.254887 -0.280418 -0.254637 -0.449808 -0.283038 -0.281087 0.484119 -0.437483 -0.357876 0.278953 -0.195350 -0.210013 -0.256719 0.311326 -0.749826 0.223531 0.257695 0.222227 0.251725 0.333630 0.223589 0.295352 0.226829 0.225709 0.228904 0.270219 0.244396 0.241127
chargesum: 0.00000
title: Mulliken charges with hydrogens summed into heavy atoms:
elementType: O O O O N C C C C C C C C C C C
charge: -0.308188 -0.254887 -0.280418 -0.254637 -0.116178 0.198187 0.192865 0.484119 -0.213894 -0.062524 0.278953 0.031479 0.015696 -0.027814 0.311326 0.005916
polarizability: 1.87423912e+02 -2.82047631e+01 1.15385547e+02 -1.71631047e+01 -1.96876177e+01 1.13499772e+02
1716.lowfreq: -5.4284 -0.5646 -0.0006 -0.0005 -0.0004 10.0736 14.1066 26.6580 44.9229
frequency: 13.3546 26.6575 44.8982 62.8986 74.1270 88.5961 98.3829 110.4839 149.7002 233.8967 257.3527 270.9949 315.2380 339.8473 347.8716 396.9503 408.5614 474.1608 509.1686 564.4610 590.4985 608.3188 613.9061 644.0695 662.6202 695.6766 700.7821 745.6093 767.1189 809.2350 841.8634 864.8914 897.5700 913.8873 952.5487 972.5327 985.1809 995.1281 995.5660 1025.7429 1026.4792 1043.0600 1050.3170 1089.9247 1097.9920 1157.0700 1172.9252 1189.6893 1200.0091 1237.2193 1260.3303 1279.7046 1325.8349 1355.5108 1365.7495 1382.9136 1387.6485 1430.8272 1434.3796 1437.2496 1452.6148 1454.9362 1486.5984 1521.1570 1602.6119 1617.9384 1656.1996 1670.8745 3006.3688 3023.2955 3028.2886 3098.3269 3100.4421 3103.3634 3115.8992 3132.4946 3143.4755 3145.0636 3165.8671 3189.4429 3541.9657
redmass: 4.7319 6.2471 5.3246 5.9667 5.4889 2.9147 1.1886 6.4820 4.0372 5.4005 4.3833 4.2344 3.4768 3.1815 5.7330 3.5794 2.9199 2.2358 2.8364 3.2304 5.1454 5.1046 6.3232 1.4313 5.7079 2.1111 3.7215 3.9157 1.6713 4.9216 1.2660 4.8228 3.6319 1.4368 3.6586 1.3566 6.0870 1.7482 1.3983 3.0711 2.2253 1.9029 2.6946 1.5671 3.0181 3.3734 1.0506 1.1151 3.4214 1.1322 2.0688 1.1167 1.3913 1.2586 1.3055 1.2595 6.6384 1.1377 1.3541 1.5650 1.0543 1.0570 2.2484 2.2335 5.1581 6.0506 9.1410 8.5182 1.0380 1.0561 1.0601 1.1066 1.0947 1.1074 1.0882 1.0870 1.1022 1.0936 1.0996 1.0953 1.0761
irintensity: 1.6703 0.5231 3.0594 2.7328 8.4498 0.3530 0.5994 0.3171 0.6029 7.7495 12.0009 12.8896 8.5058 3.8664 12.3212 7.2623 0.0080 3.6327 27.0490 6.3460 2.3184 4.4144 3.3841 22.1642 15.8489 13.9402 69.4251 8.4325 109.2753 10.0567 0.6109 3.7888 30.2483 15.6198 81.8985 0.0913 0.0416 9.8118 10.6373 45.4739 21.5979 20.8467 163.9979 22.4461 21.2928 210.5864 0.4790 3.5031 335.4111 5.2566 7.0573 33.1543 45.2939 2.6024 4.9919 52.7483 37.2753 4.5216 55.7155 90.1767 13.5884 26.5439 18.2989 475.2803 29.2646 98.5123 55.7580 347.9978 1.3517 12.3681 57.9110 14.3904 8.3405 11.8092 12.5001 1.0233 8.2232 30.5385 23.1212 4.9769 34.2331
temp: 298.150 k
press: 1.00000 atm
elementType: 8 8 8 8 7 6 6 6 6 6 6 6 6 6 6 6 1 1 1 1 1 1 1 1 1 1 1 1 1
symmnumber: 1
zpe: 593661.2 jmol-1
zpe.correction: 0.226114 hartree
zpe.thermalcorrener: 0.241920 hartree
zpe.thermalcorrenthalpy: 0.242864 hartree
zpe.thermalcorrgfe: 0.179638 hartree
zpe.sumelectzpe: -781.446929 hartree
zpe.sumelectthermal: -781.431122 hartree
zpe.sumelectthermalent: -781.430178 hartree
zpe.sumelectthermalfe: -781.493404 hartree
dipole: 0.7524 -1.2797 0.2564
dipole: 1.5065
quadrupole: -77.6678 -84.7972 -97.3929
quadrupole: -5.4625 -4.4631 -5.6834
quadrupole: 8.9515 1.8221 -10.7737 -5.4625 -4.4631 -5.6834
hfenergy: -781.6730426 hartree
pointgroup: C01 [X(C11H13N1O4)]
dipole: 0.2143062 0.2926045 -0.4687576 debye
polarizability: 173.3237744|44.0538281|106.8778668|-13.9369123|-3.1521344|136.1075891 unknown
InChI: InChI=1S/C11H13NO4/c1-9(13)15-7-8-16-11(14)12-10-5-3-2-4-6-10/h2-6,12H,7-8H2,1H3
charge 0 multiplicity 1
29 atoms
O  1.139723 1.286428 -1.513032
O  3.619815 0.259176 0.24701
O  0.493163 1.282867 0.762299
O  2.42723 -1.590924 -0.54479
N  -0.806079 0.296275 -0.960638
C  2.429267 1.921457 -1.164122
C  3.563051 0.895855 -1.093148
C  -1.95456 -0.18488 -0.273098
C  -2.9230 -0.888227 -1.038495
C  -2.162398 0.015103 1.11721
C  0.276689 0.970497 -0.435348
C  -4.087809 -1.386927 -0.421762
C  -3.335024 -0.491196 1.718437
C  -4.302773 -1.191655 0.962653
C  2.955489 -0.971643 0.404465
C  2.96335 -1.378062 1.858115
H  2.618151 2.635814 -1.983418
H  2.32945 2.456868 -0.202954
H  4.536231 1.403839 -1.200872
H  3.44077 0.121286 -1.870999
H  -0.74084 0.098722 -1.961731
H  -2.761767 -1.045805 -2.112584
H  -1.415722 0.554525 1.703438
H  -4.826008 -1.928645 -1.023302
H  -3.490531 -0.334105 2.791808
H  -5.207667 -1.579355 1.442133
H  2.173056 -0.80825 2.380724
H  3.925952 -1.131083 2.333127
H  2.749497 -2.453054 1.948874
