program: Gaussian 09
title: 000220914
version: EM64L-G09RevD.01
frameworkgroup: C1[X(C18H21N11)]
method: RPBEPBE
basis: SDD
operation: Freq
keyword: #p
keyword: freq=noraman
keyword: PBEPBE/SDD
title: #p freq=noraman PBEPBE/SDD
converged: YES YES NO NO
title: Mulliken charges:
elementType: N N N N N N N N N N N C C C C C C C C C C C C C C C C C C H H H H H H H H H H H H H H H H H H H H H
charge: -0.129723 -0.112557 -0.095675 -0.082675 -0.022871 -0.112814 -0.115853 -0.591055 -0.584271 -0.587536 -0.585890 0.238392 -0.465111 -0.429431 0.396739 -0.495731 -0.481042 -0.293917 -0.370554 -0.392327 0.128652 0.074447 -0.239407 -0.250152 -0.245119 0.037441 0.020897 0.037153 0.021351 0.216369 0.246889 0.223646 0.225036 0.216996 0.261059 0.260419 0.259615 0.250641 0.235376 0.223753 0.223461 0.225743 0.330519 0.329948 0.332452 0.332782 0.336787 0.329479 0.331623 0.336045
chargesum: 0.00000
title: Mulliken charges with hydrogens summed into heavy atoms:
elementType: N N N N N N N N N N N C C C C C C C C C C C C C C C C C C
charge: -0.129723 -0.112557 -0.095675 -0.082675 -0.022871 -0.112814 -0.115853 0.069412 0.080963 0.078731 0.081779 0.238392 -0.001853 0.019251 0.396739 -0.017676 0.038992 -0.293917 -0.119913 -0.156951 0.128652 0.074447 -0.015653 -0.026691 -0.019376 0.037441 0.020897 0.037153 0.021351
polarizability: 2.81690784e+02 -2.11801376e+01 2.76711824e+02 -1.74806234e+01 -9.72425745e+00 2.22404183e+02
1716.lowfreq: -14.4977 -8.8778 -5.0175 -3.2603 -0.0008 -0.0005 -0.0003 8.8631 19.5582
frequency: -9.6899 7.5314 19.5357 22.7352 34.0363 45.7009 53.3830 62.1604 92.6277 106.2051 114.4653 152.8755 167.5942 170.2987 178.2710 185.3714 185.7802 190.0472 193.0839 235.3655 251.9638 277.1678 305.7075 317.9062 329.4056 356.8021 394.6356 402.6145 416.6420 433.8928 471.7894 480.4228 483.1184 490.7872 493.4618 510.1599 512.0414 537.9232 547.8233 549.0415 549.4890 553.6930 554.7311 555.5154 570.6886 590.5551 598.2707 617.1233 619.9611 624.7463 663.6159 683.2917 701.6396 717.4229 720.0446 720.7477 755.1935 773.1339 804.4285 807.0824 844.9586 851.9974 886.2054 900.4267 904.9633 917.4938 922.0545 923.1786 957.3984 969.1539 976.1692 977.5485 990.9427 994.6467 1011.7677 1023.6533 1048.3765 1052.5619 1075.0604 1081.5600 1096.8045 1105.1644 1107.9600 1129.1377 1130.4027 1159.2506 1173.3028 1174.2915 1199.2658 1208.8920 1231.6429 1257.8319 1259.7027 1275.5814 1300.5235 1319.6811 1322.4763 1327.5068 1346.0993 1378.2410 1384.5884 1386.1464 1415.6700 1419.6783 1436.0999 1444.3501 1451.2278 1454.7626 1468.4701 1482.8194 1483.6450 1486.1706 1508.5228 1509.5772 1524.4811 1526.2055 1591.2378 1596.2446 1597.0311 1612.3819 1625.4138 1626.6555 2179.5970 2988.0453 2992.2780 3005.0427 3012.9538 3033.8110 3060.9343 3075.4004 3077.5099 3121.3345 3128.0603 3139.6265 3148.4447 3163.6380 3553.5314 3553.6303 3555.3389 3555.8232 3714.4811 3714.7926 3715.1670 3715.8855
redmass: 5.6130 5.7787 5.8398 5.3260 5.3710 4.1441 5.4823 3.6378 4.4168 8.6017 7.9204 6.6988 3.4216 6.0999 6.5109 5.0033 7.0694 5.8331 4.3909 3.5403 2.8886 2.4730 2.9027 2.7339 3.4112 4.0189 3.3063 2.8159 4.9148 3.6551 1.2052 1.2023 1.6024 1.9166 1.2363 3.2357 3.4787 4.0520 1.1195 1.0832 1.0399 1.0558 6.8145 7.4848 7.2238 5.2443 2.6589 6.3169 5.4235 4.7321 4.4242 4.0523 1.8369 3.2233 11.5373 11.7717 1.5871 2.0284 8.1047 8.3402 2.4157 1.2958 3.4171 8.2314 4.0052 3.0250 2.3511 1.7599 2.6991 2.2334 2.8122 1.5189 5.5325 1.3762 3.1951 2.8160 2.3287 2.8686 2.9610 1.9757 2.8912 2.6101 2.0653 2.4778 2.5231 1.4692 1.1280 1.4894 1.1272 1.4652 3.1238 2.5314 1.4858 1.7684 1.3751 1.5110 1.5147 1.3598 1.6774 7.6000 4.3636 4.0738 3.5935 3.7772 2.2088 1.2213 1.0979 1.1157 1.0997 5.5076 2.2156 4.6736 2.0730 2.0655 4.2954 4.4026 6.0460 1.4626 1.4586 5.9668 2.0206 2.0327 12.6464 1.0610 1.0630 1.0618 1.0599 1.0973 1.1024 1.1021 1.0972 1.0845 1.0873 1.0920 1.0960 1.1015 1.0439 1.0440 1.0444 1.0443 1.1058 1.1058 1.1058 1.1057
irintensity: 0.4089 0.1029 0.7257 0.1885 0.0371 0.0544 1.1427 0.1568 0.2692 2.4321 1.5428 4.1456 1.6205 1.5751 0.1369 1.9035 1.8742 10.8489 12.9330 3.2212 1.6289 5.9956 3.5551 5.8383 22.4658 5.2142 6.9490 0.1878 2.3033 2.2419 66.8485 38.9006 286.2932 161.1561 557.9364 22.2532 9.0869 12.5978 1.5488 10.2828 1.4430 0.2144 2.9444 4.8186 14.2077 3.1348 21.4690 0.0318 6.0781 4.0939 0.8791 4.3950 54.5692 18.7071 0.8128 0.0755 2.0786 17.7847 42.4360 29.0886 2.2622 1.2739 5.2984 1.1504 5.9792 21.2539 7.4768 5.9075 2.7581 9.0974 0.7360 1.0199 0.8199 0.1688 5.6182 6.1252 0.2783 1.7140 1.0904 10.4063 2.9159 0.3115 6.9180 0.0304 0.4958 1.2772 1.9132 7.6046 0.1064 6.7303 15.1324 6.5972 0.1801 5.1080 3.1574 6.9170 5.5505 0.2529 26.8167 0.6751 65.1035 44.0618 8.0349 22.3852 15.1846 56.3630 32.8645 25.1012 36.2382 524.1818 52.3064 220.6791 84.2989 75.0898 381.9333 576.2779 0.1501 403.6932 878.6959 5.8024 354.2600 86.6488 9.1538 7.4319 18.0529 22.7609 18.4971 1.6896 10.2766 20.3468 16.4694 1.6745 1.4401 16.1383 23.8319 20.1206 70.8797 202.1030 57.5558 56.2823 40.4799 30.0201 69.0180 45.0809
temp: 298.150 k
press: 1.00000 atm
elementType: 7 7 7 7 7 7 7 7 7 7 7 6 6 6 6 6 6 6 6 6 6 6 6 6 6 6 6 6 6 1 1 1 1 1 1 1 1 1 1 1 1 1 1 1 1 1 1 1 1 1
symmnumber: 1
zpe: 1028862.2 jmol-1
zpe.correction: 0.391873 hartree
zpe.thermalcorrener: 0.418113 hartree
zpe.thermalcorrenthalpy: 0.419057 hartree
zpe.thermalcorrgfe: 0.332772 hartree
zpe.sumelectzpe: -1298.759525 hartree
zpe.sumelectthermal: -1298.733285 hartree
zpe.sumelectthermalent: -1298.732341 hartree
zpe.sumelectthermalfe: -1298.818626 hartree
dipole: 0.0150 2.8036 -5.0750
dipole: 5.7980
quadrupole: -128.2995 -143.7907 -175.8438
quadrupole: -8.4988 -4.2669 5.4746
quadrupole: 21.0118 5.5206 -26.5324 -8.4988 -4.2669 5.4746
hfenergy: -1299.151398 hartree
pointgroup: C01 [X(C18H21N11)]
dipole: -0.0685887 -2.2708968 -0.204335 debye
polarizability: 281.3269965|-8.7713325|238.9346232|27.217401|25.752178|260.5451713 unknown
InChI: InChI=1S/C18H21N11/c19-10-18(11-4-2-1-3-5-11,8-6-12-24-14(20)28-15(21)25-12)9-7-13-26-16(22)29-17(23)27-13/h1-5H,6-9,20-23H2
charge 0 multiplicity 1
50 atoms
N  3.31934 -0.767235 -1.821302
N  -4.040276 -0.277607 -1.174488
N  4.178528 0.827844 -0.208773
N  -4.673692 0.303781 1.093231
N  -0.116068 3.71697 0.103182
N  5.129091 -1.426748 -0.31543
N  -6.331914 -0.679476 -0.413683
N  4.263682 -2.911733 -1.90623
N  -5.654545 -1.215326 -2.591033
N  5.910582 0.162607 1.219854
N  -6.874596 -0.095216 1.789642
C  0.055488 1.115641 -0.502541
C  0.897192 1.010855 -1.829599
C  -1.401248 0.608956 -0.819294
C  0.675062 0.295691 0.65483
C  2.364427 1.499216 -1.737728
C  -2.373022 0.720963 0.366685
C  -0.029678 2.55258 -0.143805
C  1.03699 0.883205 1.890871
C  0.863886 -1.100856 0.486268
C  3.334323 0.460151 -1.214075
C  -3.770231 0.219289 0.069275
C  1.574754 0.096792 2.935184
C  1.401269 -1.887546 1.526676
C  1.759112 -1.291969 2.759019
C  4.239009 -1.66692 -1.329458
C  -5.339887 -0.710962 -1.355963
C  5.051501 -0.161528 0.203877
C  -5.935909 -0.160054 0.793617
H  0.365704 1.601056 -2.599483
H  0.896623 -0.041604 -2.167596
H  -1.333432 -0.444073 -1.146359
H  -1.798067 1.175422 -1.68135
H  2.695763 1.765345 -2.760781
H  2.455099 2.407917 -1.118931
H  -2.459909 1.77171 0.706815
H  -1.993239 0.15991 1.242074
H  0.904596 1.960387 2.041159
H  0.606625 -1.579626 -0.465313
H  1.848867 0.572183 3.883707
H  1.545706 -2.962955 1.373564
H  2.177399 -1.902717 3.5669
H  4.94175 -3.596332 -1.582187
H  3.630309 -3.109614 -2.676174
H  -6.600864 -1.541019 -2.769916
H  -4.934869 -1.241797 -3.308541
H  5.854741 1.09219 1.628223
H  6.564853 -0.535375 1.56349
H  -7.819256 -0.423879 1.607846
H  -6.605668 0.290108 2.691344
