program: Gaussian 09
title: 000220845
version: EM64L-G09RevD.01
frameworkgroup: C1[X(C13H12ClN)]
method: RPBEPBE
basis: SDD
operation: Freq
keyword: #p
keyword: freq=noraman
keyword: PBEPBE/SDD
title: #p freq=noraman PBEPBE/SDD
converged: YES YES NO NO
title: Mulliken charges:
elementType: Cl N C C C C C C C C C C C C C H H H H H H H H H H H H
charge: -0.072259 -0.007078 -0.583667 -0.566807 0.614758 0.518936 -0.313645 -0.401267 -0.360226 -0.338395 -0.229043 -0.232552 -0.228436 -0.329053 -0.333776 0.230054 0.251538 0.224270 0.243511 0.239119 0.233122 0.240935 0.255892 0.232413 0.236316 0.237262 0.238078
chargesum: 0.00000
title: Mulliken charges with hydrogens summed into heavy atoms:
elementType: Cl N C C C C C C C C C C C C C
charge: -0.072259 -0.007078 -0.102076 -0.099025 0.614758 0.518936 -0.313645 -0.162148 -0.127103 -0.097460 0.026849 -0.000139 0.007880 -0.091791 -0.095698
polarizability: 2.07134413e+02 9.82464472e+00 1.64183701e+02 -1.50872625e+01 -5.27663312e-01 7.48123342e+01
1716.lowfreq: -7.4443 -0.0010 0.0018 0.0021 6.8844 9.9684 18.4362 30.2612 54.3246
frequency: 17.6345 30.1684 54.3124 78.1297 108.5475 155.7905 232.4732 249.4891 296.3525 335.3058 359.8266 369.4362 427.8954 444.9073 496.9959 527.8427 548.1497 611.6708 661.2833 663.4917 723.4382 749.8799 759.0990 786.0416 798.6610 810.3011 857.8169 876.1260 888.3413 947.8765 960.3971 963.1727 976.5123 985.3391 987.3458 1001.3807 1018.1931 1039.3522 1062.4212 1079.0075 1116.9016 1154.4563 1173.3749 1213.9497 1217.0026 1229.2840 1259.7853 1276.5353 1291.9264 1311.6915 1328.6031 1338.4144 1375.2530 1404.5252 1426.1823 1462.8852 1466.2406 1473.5451 1485.4313 1557.0157 1575.0486 1588.3840 1606.1934 2998.0956 3007.5515 3050.8853 3075.3278 3121.6693 3123.8498 3125.5807 3142.4699 3143.3542 3150.4002 3159.5278 3175.1252
redmass: 4.1467 5.7725 4.8050 3.8934 5.7837 5.2219 5.2029 4.1450 4.3190 2.5814 4.8706 2.5139 3.9711 3.3059 4.1316 6.3351 3.3252 4.8369 6.2354 6.9116 4.3297 3.1235 1.2874 1.2448 4.5173 1.5666 1.7978 1.9401 1.2478 1.4181 6.2492 1.4492 1.4919 1.5308 1.5980 4.0062 5.5992 2.0827 2.1948 1.6085 1.4687 1.1571 1.0587 2.2876 1.3948 2.2153 1.3901 1.3465 1.4159 4.6197 1.3766 1.2651 7.1368 2.0325 2.1762 2.3142 2.0456 1.1554 1.1018 6.7096 6.0899 5.7295 7.2277 1.0591 1.0597 1.1015 1.1049 1.0871 1.0879 1.0876 1.0893 1.0962 1.0994 1.0948 1.0997
irintensity: 0.1556 0.5562 0.2488 1.1163 1.0533 0.0827 1.7169 1.4273 1.2383 0.8497 3.0635 0.0403 2.8428 5.4993 13.4309 5.4709 24.3968 1.3840 17.2856 0.2192 2.5858 9.0151 65.3971 3.6864 4.7365 54.0429 8.1185 1.4519 0.0199 1.8947 3.2540 0.2446 0.0141 0.3783 0.7617 0.3455 48.0779 3.4477 4.2422 1.5453 5.2565 3.8984 0.5064 0.1390 1.9517 1.8476 0.4268 13.2517 0.0699 1.3174 0.5669 1.1628 1.5663 17.2396 16.8821 25.3613 18.5030 3.9349 14.2387 12.7600 6.9130 75.0067 0.6177 2.4876 40.7225 0.2136 16.9377 8.2495 11.7627 5.6127 7.2573 55.2641 1.0322 16.2416 13.5635
temp: 298.150 k
press: 1.00000 atm
elementType: 17 7 6 6 6 6 6 6 6 6 6 6 6 6 6 1 1 1 1 1 1 1 1 1 1 1 1
symmnumber: 1
zpe: 559534.6 jmol-1
zpe.correction: 0.213115 hartree
zpe.thermalcorrener: 0.226106 hartree
zpe.thermalcorrenthalpy: 0.227050 hartree
zpe.thermalcorrgfe: 0.170661 hartree
zpe.sumelectzpe: -1016.331819 hartree
zpe.sumelectthermal: -1016.318829 hartree
zpe.sumelectthermalent: -1016.317884 hartree
zpe.sumelectthermalfe: -1016.374274 hartree
dipole: -3.7772 -2.0383 0.5269
dipole: 4.3243
quadrupole: -106.4994 -85.8737 -99.3442
quadrupole: 1.9183 -0.1831 -0.0175
quadrupole: -9.2603 11.3654 -2.1051 1.9183 -0.1831 -0.0175
hfenergy: -1016.5449348 hartree
pointgroup: C01[X(C13H12Cl1N1)]
dipole: -1.5126286 0.7553008 -0.1895858 debye
polarizability: 207.5188069|-8.8895735|163.3718872|15.9214334|3.6201383|75.2397544 unknown
InChI: InChI=1S/C13H12ClN/c14-13-4-2-1-3-12(13)6-5-11-7-9-15-10-8-11/h1-4,7-10H,5-6H2
charge 0 multiplicity 1
27 atoms
Cl -1.689767 -2.534231 -0.125694
N  4.839023 -0.044966 0.277737
C  -0.295612 0.203063 0.632009
C  0.56262 0.227959 -0.676929
C  -1.78401 0.244294 0.338648
C  2.046742 0.137226 -0.37281
C  -2.529246 -0.901807 -0.030473
C  -2.499897 1.470733 0.391746
C  2.869079 1.290283 -0.307014
C  2.664997 -1.111168 -0.101895
C  -3.903756 -0.864469 -0.331346
C  -3.877813 1.543662 0.093279
C  -4.582936 0.373442 -0.269084
C  4.23844 1.15466 0.016505
C  4.041115 -1.154431 0.212358
H  -0.013117 1.067943 1.259806
H  -0.040622 -0.712048 1.196839
H  0.337471 1.157506 -1.23186
H  0.251618 -0.621375 -1.312344
H  -1.954686 2.377766 0.679726
H  2.452678 2.283511 -0.511899
H  2.083774 -2.039712 -0.143223
H  -4.431477 -1.78229 -0.606234
H  -4.399207 2.50513 0.147004
H  -5.65243 0.415162 -0.500427
H  4.891164 2.033954 0.068937
H  4.53846 -2.108995 0.419935
