program: Gaussian 09
title: 000220851
version: EM64L-G09RevD.01
frameworkgroup: C1[X(C16H19NO3)]
method: RPBEPBE
basis: SDD
operation: Freq
keyword: #p
keyword: freq=noraman
keyword: PBEPBE/SDD
title: #p freq=noraman PBEPBE/SDD
converged: YES YES NO NO
title: Mulliken charges:
elementType: O O O N C C C C C C C C C C C C C C C C H H H H H H H H H H H H H H H H H H H
charge: -0.294400 -0.229063 -0.243294 -0.391603 -0.327135 -0.417244 0.145343 -0.346475 0.372543 0.079536 0.330984 -0.216916 -0.087831 -0.384466 -0.385161 -0.681054 -0.234003 -0.227854 -0.229608 -0.679170 0.211413 0.253264 0.208715 0.204429 0.341771 0.200221 0.201431 0.290193 0.212793 0.220858 0.208289 0.295105 0.238676 0.238015 0.193224 0.268605 0.212206 0.232883 0.214780
chargesum: 0.00000
title: Mulliken charges with hydrogens summed into heavy atoms:
elementType: O O O N C C C C C C C C C C C C C C C C
charge: -0.294400 -0.229063 -0.243294 -0.049832 0.137542 -0.004100 0.145343 0.055178 0.372543 0.079536 0.330984 -0.216916 -0.087831 -0.094274 -0.090056 -0.039114 0.004673 0.010161 0.232221 -0.019301
polarizability: 2.96134036e+02 -2.01254227e+00 2.42371714e+02 6.66782121e+00 -7.35201430e-01 1.03339866e+02
1716.lowfreq: -12.0171 -6.6372 0.0003 0.0004 0.0005 2.8232 6.8705 33.2442 43.8031
frequency: -4.8373 33.1062 43.7516 51.8413 58.8087 76.2875 81.9539 124.6571 133.6123 137.1236 177.7335 183.0325 218.9061 240.9844 245.1977 251.0362 268.0603 281.3742 305.9837 337.6072 356.5821 389.1880 421.5268 427.9177 443.8459 462.3165 483.0321 539.8181 577.1599 643.6320 657.9701 674.5919 692.0613 710.0478 717.7768 740.6437 794.3823 799.2199 810.2361 819.5812 835.3078 841.1046 881.6914 924.6395 938.2236 949.8092 989.3212 997.6888 1009.1195 1012.8270 1032.7511 1043.4899 1072.9324 1085.3825 1109.4924 1117.2082 1124.5969 1130.5345 1147.9113 1167.1921 1177.8565 1221.4496 1238.3553 1241.3930 1251.9748 1268.0277 1294.8466 1296.1534 1308.3425 1324.5479 1342.5785 1360.9542 1369.2089 1392.0946 1392.3683 1400.9758 1438.7971 1459.8326 1460.1164 1469.2317 1474.1221 1475.3092 1478.0145 1480.5616 1487.9530 1491.6954 1497.2657 1508.9337 1550.9947 1585.7774 1602.7946 1613.7866 2968.3589 2973.6651 2975.4231 2979.1592 2979.8030 2990.3838 3010.8395 3042.0951 3059.6173 3071.3226 3076.4389 3077.7153 3090.8505 3105.0225 3135.6473 3151.4111 3162.3947 3171.6964 3418.1675
redmass: 4.1427 3.1271 2.5987 3.0467 3.4681 3.0119 2.0658 4.3887 4.4936 4.1768 4.5132 5.8216 1.3952 1.3262 1.9703 1.8265 4.0998 4.1296 6.6306 4.4039 5.4909 7.7728 5.2465 3.8882 5.0581 7.1500 5.0124 4.6323 6.2615 5.2769 4.9625 1.1875 4.0075 6.9946 3.2698 1.1704 2.2349 2.3277 1.0908 1.8194 3.6869 1.9975 3.3665 1.5902 2.1314 1.8054 1.3942 2.1601 1.3596 2.5106 2.4159 2.6197 4.0767 2.3588 2.2827 2.6970 2.0722 1.4501 2.1665 1.3056 2.0707 1.2877 1.8140 1.2319 1.3995 1.7052 1.6070 1.6776 1.3016 3.4965 1.3569 1.5718 1.5526 1.2165 1.2665 9.5120 2.5561 1.0433 1.1181 2.8182 1.0973 1.0716 1.0439 1.0543 1.1226 1.9154 1.2363 4.2943 3.8912 7.7536 6.6645 9.3513 1.0598 1.0646 1.0396 1.0625 1.0630 1.0369 1.0987 1.1012 1.0961 1.1008 1.0990 1.0994 1.0974 1.1016 1.0862 1.0903 1.0944 1.1001 1.0746
irintensity: 0.0250 0.1808 1.7638 0.2599 5.6852 3.8637 1.3894 0.9201 1.2750 1.9883 0.5249 1.7617 0.5357 1.0657 0.6355 0.7866 0.2430 1.4715 5.3187 0.0266 0.7542 36.0821 1.7417 2.0575 2.0483 2.4597 9.5943 0.7795 1.9726 5.7868 2.9258 54.9237 29.0671 2.0222 45.4398 13.3188 21.8266 37.7374 2.5060 3.3383 2.1215 1.8146 10.6276 0.1637 62.2857 40.5683 4.1732 12.3254 0.7061 80.6974 1.4196 46.3589 16.3499 10.9491 4.0395 4.7037 3.2274 26.1080 32.0022 76.8861 114.7691 12.2754 28.8123 11.0013 71.2207 81.5488 37.0578 43.4977 25.2676 134.5692 89.7345 4.3626 23.6201 16.7912 19.9843 5.1799 26.3727 7.9224 57.3970 6.7648 65.1107 91.8340 13.3794 12.7214 35.5089 373.5907 114.1817 6.6363 64.0141 161.1403 1.3513 236.8681 10.1423 27.7732 50.7152 101.4521 1.2824 31.0373 1.7227 38.5534 20.0151 79.1762 6.4483 44.3844 33.2296 40.4109 5.2524 8.4407 1.8448 26.9334 82.8583
temp: 298.150 k
press: 1.00000 atm
elementType: 8 8 8 7 6 6 6 6 6 6 6 6 6 6 6 6 6 6 6 6 1 1 1 1 1 1 1 1 1 1 1 1 1 1 1 1 1 1 1
symmnumber: 1
zpe: 832721.3 jmol-1
zpe.correction: 0.317167 hartree
zpe.thermalcorrener: 0.336322 hartree
zpe.thermalcorrenthalpy: 0.337267 hartree
zpe.thermalcorrgfe: 0.268816 hartree
zpe.sumelectzpe: -900.046391 hartree
zpe.sumelectthermal: -900.027235 hartree
zpe.sumelectthermalent: -900.026291 hartree
zpe.sumelectthermalfe: -900.094742 hartree
dipole: -1.8781 -0.5142 1.1972
dipole: 2.2858
quadrupole: -98.2496 -120.3340 -120.5613
quadrupole: -10.4890 1.6602 3.5807
quadrupole: 14.7987 -7.2857 -7.5130 -10.4890 1.6602 3.5807
hfenergy: -900.3635574 hartree
pointgroup: C01 [X(C16H19N1O3)]
dipole: -0.7259653 -0.2569043 0.4644865 debye
polarizability: 295.8438089|2.7289696|242.3787448|9.530648|-2.3800442|103.6230624 unknown
InChI: InChI=1S/C16H19NO3/c1-3-5-10-17-13-14(18)11-8-6-7-9-12(11)15(19)16(13)20-4-2/h6-9,17H,3-5,10H2,1-2H3
charge 0 multiplicity 1
39 atoms
O  -1.018646 2.104136 -0.326164
O  0.027459 -2.570629 0.006257
O  1.802103 2.625344 -0.186288
N  -1.799193 -0.68296 -0.246191
C  -3.054783 0.078093 -0.383514
C  -4.238603 -0.885006 -0.608984
C  -0.509389 -0.236561 -0.14107
C  -4.559518 -1.798381 0.598852
C  1.918522 -1.063742 0.092727
C  -0.058849 1.095586 -0.14515
C  2.352441 0.289224 0.059778
C  0.473667 -1.374119 -0.018709
C  1.369684 1.419493 -0.092684
C  2.859544 -2.112727 0.224402
C  3.73047 0.580227 0.158578
C  -5.793356 -2.691894 0.348065
C  4.235719 -1.815392 0.324668
C  4.669904 -0.468106 0.290712
C  -0.933581 3.335847 0.521403
C  -2.181623 4.155909 0.208181
H  -3.233117 0.684051 0.527342
H  -2.961934 0.788426 -1.222753
H  -4.044883 -1.505215 -1.508352
H  -5.131521 -0.271507 -0.83982
H  -1.861421 -1.710627 -0.210363
H  -4.730449 -1.165829 1.493359
H  -3.689524 -2.442432 0.839353
H  2.493737 -3.143976 0.245109
H  -5.635855 -3.349376 -0.527544
H  -6.007989 -3.336369 1.219582
H  -6.693096 -2.079179 0.150038
H  4.0403 1.629193 0.124616
H  4.965886 -2.625124 0.425968
H  5.738022 -0.236643 0.364688
H  -0.902593 3.024014 1.585237
H  -0.002607 3.870243 0.274804
H  -2.17425 5.088825 0.801307
H  -2.206389 4.426915 -0.861389
H  -3.102789 3.596265 0.449147
