program: Gaussian 09
title: 000220834
version: EM64L-G09RevD.01
frameworkgroup: C1[X(C8H12O2)]
method: RPBEPBE
basis: SDD
operation: Freq
keyword: #pfreq=noraman
keyword: PBEPBE/SDD
title: #p freq=noraman PBEPBE/SDD
converged: YES YES NO NO
title: Mulliken charges:
elementType: O O C C C C C C C C H H H H H H H H H H H H
charge: -0.425144 -0.452651 0.293239 -0.532304 -0.422912 -0.715104 -0.737210 0.298372 0.295762 -0.528478 0.238489 0.231449 0.216183 0.212821 0.204583 0.233438 0.208687 0.221374 0.210415 0.244853 0.355168 0.348971
chargesum: 0.00000
title: Mulliken charges with hydrogens summed into heavy atoms:
elementType: O O C C C C C C C C
charge: -0.069976 -0.103681 0.293239 -0.062367 -0.206729 -0.064263 -0.096733 0.298372 0.295762 -0.283625
polarizability: 1.06856461e+02 -1.63825620e+00 1.04838394e+02 3.14016973e+00 5.89756638e-02 6.50094846e+01
1716.lowfreq: -4.0170 -0.0003 0.0006 0.0007 9.5966 13.0572 104.3012 134.8913 187.3902
frequency: 104.2829 134.8897 187.3887 224.2801 249.1593 281.3134 292.1046 316.3767 343.5593 402.0873 425.7751 446.6251 472.7760 480.3597 489.6090 511.3130 556.4551 592.9758 743.5376 797.7969 806.3893 883.0387 904.6042 916.7825 931.4134 968.3129 986.9868 1006.5128 1081.4883 1118.8424 1136.5395 1164.1901 1182.2392 1228.0069 1258.9590 1267.5720 1299.6030 1367.4722 1377.4435 1392.2901 1438.0130 1443.2820 1462.2983 1464.7291 1476.3957 1483.9746 1623.0711 1663.2875 2958.4840 2965.7560 2970.2130 3045.9786 3060.4355 3066.2448 3072.3340 3080.1724 3107.5377 3146.3703 3551.3044 3576.4145
redmass: 2.7982 3.3384 4.2390 1.0497 1.5854 1.4041 3.5792 2.5125 2.6616 1.1594 2.2143 2.7927 1.3750 4.6467 3.2386 2.9676 4.6063 2.5332 1.6523 2.5224 1.8093 3.0384 2.2821 2.1160 1.5646 2.1654 2.1006 1.4108 1.9722 1.5342 1.8699 1.3854 1.4481 1.9204 1.8603 2.5000 1.6498 1.1934 1.5633 1.5650 1.7584 1.3254 1.0504 1.0565 1.0550 1.0628 8.7410 7.3191 1.0642 1.0357 1.0362 1.0938 1.0988 1.0988 1.0998 1.0999 1.0913 1.0928 1.0654 1.0655
irintensity: 0.5628 0.0488 7.1875 0.0281 0.7535 1.2721 9.2403 3.0629 8.3391 78.7694 65.5783 1.9720 107.7576 3.5968 11.2077 2.7089 4.9557 25.6672 34.3656 25.0084 41.6675 12.2929 21.4644 2.9668 4.9091 20.8596 22.8558 2.7249 282.0549 71.7868 46.8914 5.1143 34.3744 14.7576 13.4561 2.8076 16.2926 20.8739 22.6222 6.1966 13.7128 3.0519 1.3148 12.6361 9.5063 14.8140 113.8194 187.7416 30.1128 26.9538 43.0863 8.9461 7.6353 56.5160 41.3697 31.4931 19.9347 11.1437 23.5551 20.7401
temp: 298.150 k
press: 1.00000 atm
elementType: 8 8 6 6 6 6 6 6 6 6 1 1 1 1 1 1 1 1 1 1 1 1
symmnumber: 1
zpe: 478432.4 jmol-1
zpe.correction: 0.182225 hartree
zpe.thermalcorrener: 0.192633 hartree
zpe.thermalcorrenthalpy: 0.193577 hartree
zpe.thermalcorrgfe: 0.147688 hartree
zpe.sumelectzpe: -461.685763 hartree
zpe.sumelectthermal: -461.675356 hartree
zpe.sumelectthermalent: -461.674412 hartree
zpe.sumelectthermalfe: -461.720300 hartree
dipole: -0.4179 0.5129 0.1534
dipole: 0.6791
quadrupole: -57.0271 -56.7952 -63.1838
quadrupole: -5.6112 1.6789 -0.8766
quadrupole: 1.9749 2.2068 -4.1818 -5.6112 1.6789 -0.8766
hfenergy: -461.8679883 hartree
pointgroup: C01 [X(C8H12O2)]
dipole: -0.1840167 0.1876869 0.0479439 debye
dipolederiv: -0.461575 0.6126043 0.038645 0.5280319 -1.1716813 0.0583863 -0.0164842 0.1280879 -0.3889566 -0.5658631 -0.4573111 0.0286493 -0.6996131 -0.9549861 -0.013355 0.0492486 -0.0060796 -0.3963644 0.2360114 0.0043195 -0.0326035 0.1231029 0.0564646 -0.0264253 0.0055798 -0.0352315 0.1971738 -0.1656836 0.0967573 -0.0615415 0.0079884 0.0210502 -0.0187864 -0.0688013 -0.041962 0.0815481 -0.5100111 -0.0868606 -0.0046503 0.0556143 -0.1675674 -0.0633012 -0.1490213 -0.0155965 -0.3881707 -0.040418 0.0035979 0.0238675 -0.0884693 0.0758176 0.0304485 0.0009249 0.0240865 -0.0972806 -0.0035446 -0.0046014 -0.0454166 -0.0133301 0.0898721 0.0054056 -0.0319432 0.0096969 0.025831 0.499109 -0.2581786 0.1094192 -0.3549098 1.2518685 -0.0073563 0.1823383 0.0445259 0.0880228 0.8231167 0.2024866 0.0298417 0.2999837 1.1599688 -0.0157491 0.054646 -0.0582449 0.0469777 -0.0568925 -0.1752231 0.051352 0.1483726 -0.7208961 0.0104043 0.0781799 -0.0675066 -0.2556087 0.0372434 -0.0388781 -0.0008465 0.0251121 0.0852018 0.0068488 0.0118819 -0.0687183 -0.1449931 0.0486892 -0.0826764 0.0153783 -0.0726813 -0.0703227 0.0401301 0.0289722 0.081298 0.0850096 0.0222418 0.0807825 -0.0123292 0.0449955 -0.1165384 0.036103 -0.0110627 0.0434308 0.1883942 0.0119849 0.0914948 0.0720568 0.1331818 -0.056817 -0.0808277 0.02451 -0.0284732 0.0499247 -0.0107311 -0.1115155 0.0448163 -0.1721906 -0.1037957 0.0541902 0.0597586 -0.0019645 0.0477456 -0.0436605 0.0174081 -0.1478717 0.0087121 0.0731611 0.0161025 -0.1012245 0.0074984 -0.0041392 -0.0306457 0.0850839 0.0144389 0.1568192 -0.0545022 -0.0458077 0.0572929 -0.0741073 0.057549 0.0747124 -0.0091618 0.075517 0.0041272 0.0800847 0.0345747 0.0215292 0.0327008 -0.1668007 -0.0199665 -0.079488 -0.0156071 -0.1595334 -0.1096129 0.0017285 0.0099243 0.0364385 0.0823628 -0.0766389 0.0265133 -0.0712707 0.022807 0.0802606 0.002207 -0.084713 0.011656 0.1818659 0.1041931 -0.1176148 -0.0784108 -0.1492378 0.2971277 -0.0413331 -0.082273 -0.034563 0.3489387 0.1283285 0.2004613 -0.0334341 0.1511167 0.2558422 0.0164125 -0.0392632 0.0130278 0.3609702 unknown
polarizability: 106.7399717|-1.3473525|104.5633586|5.1137389|-0.5386833|65.4010094 unknown
InChI: InChI=1S/C8H12O2/c1-8(2)4-6(9)3-7(10)5-8/h3-4,9-10H,5H2,1-2H3
charge 0 multiplicity 1
22 atoms
O  1.643288 -2.352154 0.109486
O  1.556408 2.486777 -0.008242
C  -1.335628 -0.062695 -0.03973
C  -0.425042 -1.237384 -0.515116
C  -0.582263 1.26689 -0.172368
C  -1.732068 -0.274245 1.453969
C  -2.618791 -0.040929 -0.909063
C  0.999267 -1.113769 -0.025675
C  0.776274 1.307691 -0.012004
C  1.586093 0.102064 0.188637
H  -0.400602 -1.261363 -1.625538
H  -0.844194 -2.20428 -0.180521
H  -1.171787 2.18505 -0.301361
H  -2.342474 0.573194 1.815653
H  -2.321916 -1.203783 1.577382
H  -0.833493 -0.344126 2.093006
H  -3.301083 0.765589 -0.580629
H  -2.373861 0.131175 -1.97325
H  -3.165772 -0.999224 -0.828347
H  2.634151 0.224441 0.484114
H  2.592656 -2.23095 0.368257
H  0.972741 3.280035 -0.108258
