program: Gaussian 09
title: 000220853
version: EM64L-G09RevD.01
frameworkgroup: C1[X(C19H25NO3)]
method: RPBEPBE
basis: SDD
operation: Freq
keyword: #p
keyword: freq=noraman
keyword: PBEPBE/SDD
title: #p freq=noraman PBEPBE/SDD
converged: YES YES NO NO
title: Mulliken charges:
elementType: O O O N C C C C C C C C C C C C C C C C C C C H H H H H H H H H H H H H H H H H H H H H H H H H
charge: -0.294140 -0.227900 -0.242853 -0.398947 -0.363373 -0.367930 -0.448237 -0.352250 -0.322705 -0.356273 0.143289 0.078967 -0.216662 0.373088 0.333205 -0.695288 -0.089712 -0.384496 -0.385655 -0.234023 -0.227992 -0.229892 -0.679851 0.197360 0.192111 0.191736 0.189652 0.206000 0.215995 0.189053 0.187533 0.213775 0.247349 0.195845 0.195346 0.346578 0.216680 0.210228 0.209801 0.290304 0.295117 0.238660 0.237988 0.192740 0.268942 0.215968 0.233036 0.211831
chargesum: 0.00000
title: Mulliken charges with hydrogens summed into heavy atoms:
elementType: O O O N C C C C C C C C C C C C C C C C C C C
charge: -0.294140 -0.227900 -0.242853 -0.052369 0.026099 0.013457 -0.026242 0.024337 0.138420 0.034918 0.143289 0.078967 -0.216662 0.373088 0.333205 -0.058578 -0.089712 -0.094192 -0.090538 0.004637 0.009996 0.231790 -0.019016
polarizability: 3.54522974e+02 -7.24407305e+00 2.63882064e+02 -4.46615830e+00 -6.25270804e+00 1.27480626e+02
1716.lowfreq: -8.3352 -0.0010 0.0005 0.0011 4.2473 6.2934 13.7634 24.6895 30.0295
frequency: 12.7734 24.6262 29.9916 43.2385 49.1769 55.4667 71.4597 80.8431 87.8850 103.6414 125.7960 128.9190 133.1628 147.3583 158.8173 177.6507 185.3566 195.5462 224.7135 242.6484 267.7512 280.4874 301.4756 325.0520 344.0883 349.9088 382.3165 426.7782 435.0630 444.0095 458.3609 467.3376 485.8880 531.5290 576.2536 642.2295 661.3430 677.9240 692.1349 711.0340 717.9126 724.4370 733.1099 762.7438 795.4225 800.5220 810.0906 827.0287 836.1536 875.3021 888.5159 915.5074 924.9729 941.8045 989.6851 996.8215 1002.3239 1009.0990 1009.4586 1022.9361 1034.9409 1048.7094 1072.2992 1078.8434 1080.7568 1086.6373 1108.3382 1114.0203 1128.8600 1130.9307 1152.7454 1167.3864 1177.6405 1194.0310 1226.6177 1236.9918 1239.7048 1241.3049 1260.0154 1271.4639 1283.0468 1283.9371 1294.8882 1296.2018 1298.0777 1321.6518 1323.9153 1344.9735 1355.3115 1358.4397 1371.3165 1388.5027 1392.8940 1400.4714 1438.6437 1459.7305 1463.8547 1464.5296 1468.7612 1469.1591 1473.9419 1476.1344 1479.4964 1481.2804 1487.2622 1490.8850 1493.3301 1497.2042 1510.3136 1552.3230 1585.4887 1602.5172 1613.8775 2953.0783 2955.4733 2959.4456 2965.4454 2970.2515 2972.3987 2973.9809 2978.3472 2988.5316 2990.3178 2998.4636 3011.8012 3026.8774 3041.2054 3064.2473 3068.8468 3071.9086 3076.6504 3090.7903 3104.9259 3135.6923 3151.7993 3162.9356 3172.0107 3413.9675
redmass: 4.7076 4.2015 2.4180 3.5881 1.7033 3.6637 3.1370 2.3636 2.1620 3.7840 4.5796 2.9625 1.8906 3.3028 4.2873 4.0761 5.2928 3.6423 1.1324 1.1885 4.3823 4.1576 5.2855 4.2926 4.8066 5.2537 8.7798 3.7268 4.3817 4.9619 6.4971 4.8859 4.0018 5.5343 6.5192 6.1733 6.5341 1.1797 4.1615 7.2113 3.2046 1.0617 1.0836 1.1345 2.0254 2.6064 1.0918 1.1960 3.8948 6.1757 1.8954 1.2101 1.5950 7.0927 1.3935 4.5557 1.1424 1.9793 1.5980 3.2091 2.3499 3.2892 2.8683 2.8033 2.2166 2.5284 2.4152 2.5563 1.9203 2.0945 1.5727 1.3031 2.0799 1.5731 1.3524 1.3270 1.6388 1.3229 1.7511 1.1809 1.2348 1.2665 1.1283 2.1855 1.1004 1.9261 2.4152 1.4054 1.5740 1.6539 1.6147 1.2171 1.2735 9.5222 2.5608 1.0432 1.0724 1.0724 1.4213 1.7529 1.0826 1.0425 1.0773 1.0724 1.1281 1.1530 1.6623 1.3688 4.0086 3.6914 7.8646 6.6493 9.4658 1.0588 1.0589 1.0593 1.0600 1.0600 1.0367 1.0663 1.0652 1.0969 1.0367 1.0989 1.1012 1.1027 1.1035 1.0984 1.1007 1.0992 1.0989 1.0975 1.1015 1.0862 1.0904 1.0944 1.1001 1.0749
irintensity: 0.1171 0.0259 0.3533 0.6055 0.3336 4.9160 2.0140 2.7167 0.0606 3.4672 0.1189 0.5340 0.0627 0.2500 1.0891 1.0501 1.8508 1.5793 0.0003 1.0139 0.3619 1.2026 3.5279 0.9811 0.7164 0.7697 31.0708 1.4286 2.4740 2.7608 0.4325 10.4913 7.2444 1.1926 2.3167 5.5640 1.2056 56.8435 27.5536 2.3631 52.0315 13.6686 0.0776 1.0185 26.0490 34.6211 2.4539 1.2138 1.4855 6.2330 5.4235 0.8004 0.2016 110.3654 4.1073 3.0355 0.1860 25.0939 12.2381 45.7504 29.0581 1.5552 23.5783 11.9981 1.5871 27.5785 4.1649 5.7881 8.9292 31.4751 3.0048 75.8740 115.6137 0.8954 11.7465 5.4776 49.6420 10.1734 104.4210 3.6276 15.7591 19.1488 1.0610 60.7050 0.8440 27.2973 155.9948 50.7768 22.7167 8.8525 27.2412 10.1887 23.6093 5.1128 21.6873 8.0175 2.6649 1.9279 26.8678 8.9025 22.8785 12.7172 59.5862 20.9957 44.3897 132.5446 224.5421 167.8859 12.7965 65.7195 178.7387 1.8393 263.8680 0.6271 1.4846 1.0495 10.4095 89.2658 35.2362 102.4107 41.4191 0.4983 30.7943 1.2963 2.3526 0.7994 101.5409 42.6554 106.0946 54.8718 6.3245 33.7238 39.8783 5.3315 9.0896 1.7721 27.1844 78.9675
temp: 298.150 k
press: 1.00000 atm
elementType: 8 8 8 7 6 6 6 6 6 6 6 6 6 6 6 6 6 6 6 6 6 6 6 1 1 1 1 1 1 1 1 1 1 1 1 1 1 1 1 1 1 1 1 1 1 1 1 1
symmnumber: 1
zpe: 1052102.9 jmol-1
zpe.correction: 0.400725 hartree
zpe.thermalcorrener: 0.425116 hartree
zpe.thermalcorrenthalpy: 0.426061 hartree
zpe.thermalcorrgfe: 0.343157 hartree
zpe.sumelectzpe: -1017.716020 hartree
zpe.sumelectthermal: -1017.691628 hartree
zpe.sumelectthermalent: -1017.690684 hartree
zpe.sumelectthermalfe: -1017.773588 hartree
dipole: -1.9190 -0.4342 1.3366
dipole: 2.3786
quadrupole: -120.8965 -140.9834 -139.8310
quadrupole: -9.4169 2.3920 4.2293
quadrupole: 13.0071 -7.0798 -5.9273 -9.4169 2.3920 4.2293
hfenergy: -1018.1167447 hartree
pointgroup: C01 [X(C19H25N1O3)]
dipole: 0.7577135 -0.1790042 -0.5191959 debye
polarizability: 354.8701326|5.1933087|263.3676936|-1.3458963|8.5948977|127.6478382 unknown
InChI: InChI=1S/C19H25NO3/c1-3-5-6-7-10-13-20-16-17(21)14-11-8-9-12-15(14)18(22)19(16)23-4-2/h8-9,11-12,20H,3-7,10,13H2,1-2H3
charge 0 multiplicity 1
48 atoms
O  -0.375877 2.006943 0.271926
O  -1.345389 -2.662671 -0.288148
O  -3.208396 2.462873 0.379072
N  0.456381 -0.74395 -0.080126
C  4.253135 -0.123101 0.029823
C  5.489502 -1.049028 0.071242
C  2.917409 -0.898702 0.014419
C  6.82776 -0.27646 0.08949
C  1.700641 0.045545 -0.045624
C  8.066024 -1.201298 0.120439
C  -0.847711 -0.327944 -0.042142
C  -1.324834 0.987904 0.092698
C  -1.812822 -1.482098 -0.151892
C  -3.268312 -1.203426 -0.125673
C  -3.727205 0.13316 0.025964
C  9.399049 -0.422383 0.140377
C  -2.759612 1.277068 0.173938
C  -4.194287 -2.266803 -0.248389
C  -5.114587 0.393637 0.052607
C  -5.580043 -1.99997 -0.222716
C  -6.038936 -0.668947 -0.071537
C  -0.54572 3.287926 -0.484919
C  0.698277 4.122306 -0.194232
H  4.274356 0.556049 0.907086
H  4.312983 0.525478 -0.869016
H  5.430837 -1.700836 0.967833
H  5.470093 -1.726673 -0.807835
H  2.900823 -1.582456 -0.859911
H  2.846991 -1.533301 0.921182
H  6.852384 0.396482 0.972147
H  6.88545 0.38077 -0.803576
H  1.769182 0.688379 -0.946477
H  1.687702 0.723041 0.825164
H  8.007328 -1.858865 1.011825
H  8.041248 -1.872355 -0.762432
H  0.540424 -1.765255 -0.190066
H  10.267733 -1.105767 0.164081
H  9.461038 0.234042 1.028931
H  9.497448 0.218266 -0.756397
H  -3.809409 -3.284961 -0.362079
H  -5.442674 1.430277 0.175635
H  -6.298592 -2.82082 -0.317433
H  -7.114273 -0.46146 -0.048224
H  -0.634988 3.044407 -1.563241
H  -1.472714 3.777001 -0.146339
H  1.61633 3.605495 -0.525747
H  0.782204 4.324982 0.887397
H  0.631548 5.090598 -0.723501
