program: Gaussian 09
title: 000220813
version: EM64L-G09RevD.01
frameworkgroup: C1[X(C12H23N)]
method: RPBEPBE
basis: SDD
operation: Freq
keyword: #pfreq=noraman
keyword: PBEPBE/SDD
title: #p freq=noraman PBEPBE/SDD
converged: YES YES NO NO
title: Mulliken charges:
elementType: N C C C C C C C C C C C C H H H H H H H H H H H H H H H H H H H H H H H
charge: -0.292308 -0.109371 -0.492329 -0.390808 -0.377742 -0.367899 -0.446414 -0.367538 -0.237190 -0.235781 -0.352836 -0.355845 -0.696398 0.218799 0.217100 0.223954 0.215866 0.179692 0.205458 0.176169 0.188097 0.187295 0.235603 0.214518 0.216571 0.187616 0.190850 0.238607 0.227267 0.187747 0.186912 0.195467 0.194503 0.215091 0.209458 0.209820
chargesum: 0.00000
title: Mulliken charges with hydrogens summed into heavy atoms:
elementType: N C C C C C C C C C C C C
charge: -0.056705 0.109428 -0.051276 0.004751 0.003884 0.007493 -0.015326 0.010928 0.001417 -0.008515 0.021823 0.034125 -0.062030
polarizability: 1.88543794e+02 -1.15770773e+00 1.17282568e+02 -5.06224775e+00 -7.87879930e-01 1.06506421e+02
1716.lowfreq: -14.5734 -3.7699 -0.0006 0.0005 0.0008 7.1946 22.7729 28.4161 41.9642
frequency: 22.5682 28.2952 41.9391 56.6006 79.3253 84.0740 104.5806 127.6333 132.6540 155.5386 191.6710 227.2970 228.8197 276.8693 339.5005 380.0195 443.2966 482.1734 526.3254 618.2791 677.5745 720.8786 732.4531 733.1627 758.7844 766.6431 827.5125 828.9472 880.0422 889.1048 914.1253 916.8847 945.8055 972.6248 992.9151 996.8440 1000.7831 1024.3666 1048.6022 1065.2346 1070.7830 1080.3039 1082.4982 1095.7947 1121.6151 1135.1262 1139.2572 1176.0561 1192.5453 1195.5005 1222.6057 1231.0764 1257.5951 1261.2373 1271.8584 1273.3770 1277.9562 1286.4319 1288.3496 1291.1542 1302.7009 1323.6001 1339.9111 1350.6198 1355.3127 1375.5886 1387.9585 1447.7890 1461.0732 1461.7801 1462.7144 1466.9648 1473.3251 1473.5991 1476.4856 1481.3121 1487.7398 1492.9684 1624.4245 2852.0297 2950.4064 2950.7883 2955.6279 2958.5793 2961.3485 2967.8270 2970.6703 2972.4092 2984.8670 2991.6987 2995.5590 3005.4927 3012.7877 3025.3591 3030.7068 3044.2127 3067.1650 3069.3961 3081.0989 3126.2393 3161.3701 3411.0149
redmass: 3.6412 1.7852 3.4560 3.2405 2.0217 1.9562 3.0157 1.7805 2.4676 2.4919 4.0847 1.3529 2.0618 2.3536 2.8750 3.8108 3.0146 3.1966 1.8723 2.8165 1.3601 1.0638 1.3442 1.3194 2.9261 1.1834 1.5702 1.2208 2.0166 1.8714 1.2681 2.5687 1.3084 2.1395 2.8094 1.2543 2.7311 2.6875 3.0724 1.8743 2.0998 2.0092 2.1410 1.2686 2.4195 1.5198 2.8017 1.9608 1.6120 1.2989 1.2961 1.3564 1.3437 1.3318 1.2398 1.2734 1.0576 1.5030 1.0849 1.1355 1.2738 1.3908 1.5921 1.5389 1.6781 1.4694 1.2175 1.1922 1.0930 1.0767 1.0707 1.0715 1.0871 1.0833 1.0424 1.0796 1.0875 1.0919 6.2543 1.0709 1.0588 1.0590 1.0619 1.0836 1.0622 1.0588 1.0367 1.0617 1.0966 1.0838 1.0994 1.0702 1.1022 1.0927 1.1033 1.1029 1.1007 1.0993 1.1018 1.0853 1.1070 1.0738
irintensity: 0.0459 0.0718 0.0429 0.2381 0.1188 0.6900 0.5848 0.5360 0.0838 0.6922 0.3457 0.3918 1.0785 0.8331 0.3556 0.3997 1.0710 2.2637 3.4778 22.6246 106.8734 12.7426 20.9732 14.8323 8.0186 1.5138 0.5249 1.2859 9.4075 2.9999 0.8954 9.7968 1.1380 1.3115 7.9774 2.1393 5.2761 1.7104 0.4943 17.3229 3.0493 0.4585 1.9246 1.4426 5.2762 17.8657 65.4698 4.4358 0.5399 1.2292 5.4285 0.1618 1.6445 1.9193 1.0627 1.5075 0.6962 0.9962 0.4441 0.1512 7.6346 0.0393 17.7517 4.9047 0.2401 5.1180 10.6208 25.9207 9.9748 2.9320 0.0922 1.5950 4.8055 4.5363 12.3345 3.2451 15.0980 11.1593 3.1891 90.1580 0.6342 0.4000 2.3703 33.6005 30.5048 145.1920 37.5708 51.9959 0.9580 43.1063 0.2104 17.5304 0.2683 44.1063 14.3393 147.8725 98.8775 56.4025 47.0639 11.1276 28.3234 1.6496
temp: 298.150 k
press: 1.00000 atm
elementType: 7 6 6 6 6 6 6 6 6 6 6 6 6 1 1 1 1 1 1 1 1 1 1 1 1 1 1 1 1 1 1 1 1 1 1 1
symmnumber: 1
zpe: 855236.6 jmol-1
zpe.correction: 0.325742 hartree
zpe.thermalcorrener: 0.341644 hartree
zpe.thermalcorrenthalpy: 0.342588 hartree
zpe.thermalcorrgfe: 0.279682 hartree
zpe.sumelectzpe: -524.729249 hartree
zpe.sumelectthermal: -524.713348 hartree
zpe.sumelectthermalent: -524.712404 hartree
zpe.sumelectthermalfe: -524.775310 hartree
dipole: 0.0497 0.5844 -0.3334
dipole: 0.6746
quadrupole: -80.6877 -84.7217 -81.6128
quadrupole: 0.3919 -0.9257 -0.4324
quadrupole: 1.6530 -2.3809 0.7279 0.3919 -0.9257 -0.4324
hfenergy: -525.0549914 hartree
pointgroup: C01 [X(C12H23N1)]
dipole: -0.0262142 0.2447027 -0.0993626 debye
polarizability: 188.671319|-1.1231707|111.2822125|-3.8274738|-5.5335218|112.3792515 unknown
InChI: InChI=1S/C12H23N/c1-2-3-4-5-8-11-13-12-9-6-7-10-12/h6,9,12-13H,2-5,7-8,10-11H2,1H3
charge 0 multiplicity 1
36 atoms
N  -1.736913 -0.43711 0.459446
C  -3.030462 -0.620426 -0.244219
C  -4.171338 -1.014044 0.750473
C  0.746025 -0.2466 0.451854
C  -0.537985 -0.30785 -0.399316
C  2.029033 -0.102716 -0.396733
C  -5.459116 -0.279215 0.264138
C  3.317094 -0.055734 0.455966
C  -3.603701 0.619449 -0.944995
C  -4.915278 0.813634 -0.649447
C  4.604716 0.094276 -0.385238
C  5.892251 0.133893 0.469477
C  7.174523 0.288622 -0.376687
H  -2.863255 -1.427264 -0.988854
H  -3.888863 -0.655395 1.758104
H  -4.297733 -2.107391 0.818775
H  0.798896 -1.161524 1.073369
H  0.678021 0.609937 1.156593
H  -0.499188 -1.198456 -1.058819
H  -0.5672 0.585102 -1.074461
H  2.094576 -0.950604 -1.110569
H  1.964909 0.81848 -1.013372
H  -1.797873 0.336119 1.139527
H  -6.062286 0.125786 1.099098
H  -6.125484 -0.960273 -0.303722
H  3.249656 0.787781 1.174934
H  3.384087 -0.97969 1.067641
H  -3.000292 1.247687 -1.609956
H  -5.538397 1.630793 -1.030636
H  4.671895 -0.745981 -1.107987
H  4.541311 1.021484 -0.992903
H  5.955873 -0.794018 1.073977
H  5.822421 0.971511 1.193456
H  8.079395 0.316718 0.258155
H  7.147878 1.223067 -0.968853
H  7.285403 -0.553353 -1.086118
