program: Gaussian 09
title: 000220792
version: EM64L-G09RevD.01
frameworkgroup: C1[X(C4H8BrNO)]
method: RPBEPBE
basis: SDD
operation: Freq
keyword: #p
keyword: freq=noraman
keyword: PBEPBE/SDD
title: #p freq=noraman PBEPBE/SDD
converged: YES YES NO NO
title: Mulliken charges:
elementType: Br O N C C C C H H H H H H H H
charge: -0.044297 -0.265414 -0.344072 -0.338970 -0.647005 0.294221 -0.730154 0.257580 0.220875 0.313621 0.209247 0.235666 0.221605 0.308079 0.309017
chargesum: 0.00000
title: Mulliken charges with hydrogens summed into heavy atoms:
elementType: Br O N C C C C
charge: -0.044297 -0.265414 -0.030450 0.139485 0.019512 0.294221 -0.113057
polarizability: 8.85356239e+01 -7.76209463e+00 7.72593380e+01 1.47855334e+00 4.30401540e+00 4.30126342e+01
1716.lowfreq: -7.0779 -5.7667 -0.0003 -0.0002 0.0004 7.0265 23.5987 59.8017 104.6479
frequency: 23.1403 59.7646 104.6463 143.5346 205.7994 284.2637 329.6169 398.5702 557.6089 587.1718 619.5664 655.2941 776.0389 869.7143 879.5363 932.7689 1077.1016 1112.5073 1141.2022 1147.3785 1225.0548 1250.9053 1284.6369 1355.4552 1390.9094 1412.0017 1469.4361 1472.1513 1481.8058 1513.6215 1608.4626 2985.3420 3001.3241 3068.5485 3070.6996 3087.1393 3099.6657 3153.8596 3504.8235
redmass: 2.5531 3.9485 3.2673 2.6329 1.4708 2.6043 6.8402 2.7717 3.1541 3.9216 5.1755 1.1442 1.2894 1.7168 2.0864 2.8024 2.9246 2.4563 1.2655 1.5349 1.2194 1.9839 1.1683 1.3107 1.2153 1.0965 1.0537 1.0588 1.0739 1.9413 8.2261 1.0359 1.0647 1.0986 1.0567 1.0984 1.1020 1.1090 1.0776
irintensity: 0.1887 11.6519 5.9257 5.9427 4.8144 2.1587 11.4696 2.9961 7.1702 3.2015 94.7315 99.2429 10.1837 16.3961 7.4790 1.6518 6.9333 9.3890 6.7346 11.0156 34.4848 28.4943 47.3472 2.6501 17.0742 28.2750 27.1894 6.5699 18.8391 193.3691 203.8597 24.7920 39.0605 7.2467 1.8851 34.1404 32.5506 0.1010 43.6111
temp: 298.150 k
press: 1.00000 atm
elementType: 35 8 7 6 6 6 6 1 1 1 1 1 1 1 1
symmnumber: 1
zpe: 313069.1 jmol-1
zpe.correction: 0.119242 hartree
zpe.thermalcorrener: 0.127916 hartree
zpe.thermalcorrenthalpy: 0.128860 hartree
zpe.thermalcorrgfe: 0.082948 hartree
zpe.sumelectzpe: -300.107179 hartree
zpe.sumelectthermal: -300.098505 hartree
zpe.sumelectthermalent: -300.097560 hartree
zpe.sumelectthermalfe: -300.143473 hartree
dipole: -0.7100 -2.3359 -0.4646
dipole: 2.4852
quadrupole: -51.7867 -56.1067 -51.6308
quadrupole: 8.8030 1.4912 0.5067
quadrupole: 1.3880 -2.9320 1.5440 8.8030 1.4912 0.5067
hfenergy: -300.2264205 hartree
pointgroup: C01 [X(C4H8Br1N1O1)]
dipole: 0.7861858 -0.5783974 -0.0581804 debye
dipolederiv: -0.2356696 -0.0223727 -0.0362214 -0.224742 -0.5839794 -0.2533678 -0.1301962 -0.2053612 -0.2600548 -0.70809 -0.1865829 -0.1651206 0.3291738 -0.9302848 -0.1771596 0.0395164 -0.293789 -0.4784284 -1.1937985 0.1248187 -0.0511492 0.1875832 -0.4786329 0.0482423 -0.0749489 0.0718603 -0.461741 0.5658377 0.0716117 0.0655634 0.2358556 0.1655889 -0.0405201 0.1635847 -0.0990785 0.297182 -0.0755748 -0.0294411 0.0336501 -0.0578682 0.0902112 0.0250858 0.0281549 0.0506506 -0.0239566 1.3617664 0.0368942 0.3308754 -0.7626237 0.8128952 0.0982139 0.0318228 0.2684766 0.3053814 -0.1360992 -0.1101988 -0.109929 0.215221 0.8141846 0.3689775 0.0282053 0.2884291 0.2235567 0.0804313 0.0635395 0.0665843 -0.0365801 0.0055424 -0.0880639 0.013394 -0.0329228 0.0608094 -0.051249 0.0087464 -0.0558318 0.0189352 -0.006422 0.1538817 -0.0730799 0.1056271 -0.0494948 0.2562768 0.0686048 0.0077079 0.0638028 0.2069303 -0.0392198 -0.0158821 -0.0536204 0.2951907 0.0830589 0.0081733 0.0334845 0.057855 -0.1052564 -0.1165025 0.0578187 -0.0772336 0.0204863 0.0720652 0.0709649 -0.0485066 0.039507 -0.0064464 0.1121239 -0.0063884 0.0987107 -0.0291511 -0.144721 -0.0721528 -0.0753938 -0.0898611 0.0809279 -0.0368657 -0.0830968 -0.0449916 0.0422897 0.0930685 -0.0019657 -0.0302155 0.025972 -0.0582818 0.0263683 -0.0562004 -0.0371842 0.0244753 0.0326974 -0.0306397 0.0345024 -0.0022304 -0.0069768 -0.0811941 0.0772958 -0.0395731 0.0334551 unknown
polarizability: 76.0000067|3.7802802|80.8335187|8.2417567|17.9412003|51.9740706 unknown
InChI: InChI=1S/C4H8BrNO/c1-2-6-4(7)3-5/h6H,2-3H2,1H3
charge 0 multiplicity 1
15 atoms
Br -1.747194 -2.298743 -1.264897
O  -0.754707 1.36138 0.611123
N  0.500383 -0.571412 0.19902
C  1.761863 -0.062047 0.76853
C  2.843282 0.165731 -0.307715
C  -0.642943 0.178841 0.153928
C  -1.904524 -0.419035 -0.475029
H  1.516702 0.885467 1.277889
H  2.12375 -0.776477 1.532461
H  0.481605 -1.507384 -0.21657
H  3.085254 -0.770221 -0.844474
H  2.505646 0.912367 -1.047016
H  3.77225 0.537475 0.161409
H  -2.237419 0.217656 -1.307766
H  -2.697145 -0.491198 0.284508
