program: Gaussian 09
title: 000018747
version: EM64L-G09RevD.01
frameworkgroup: C1[X(C7H3Cl2NO)]
method: RPBEPBE
basis: SDD
operation: Freq
keyword: #p
keyword: freq=noraman
keyword: PBEPBE/SDD
title: #p freq=noraman PBEPBE/SDD
converged: YES YES YES YES
title: Mulliken charges:
elementType: Cl Cl O N C C C C C C C H H H
charge: 0.014912 0.018949 -0.411325 0.007742 0.629891 0.349281 -0.261440 -0.270373 -0.406934 -0.375979 -0.220497 0.262776 0.292754 0.370243
chargesum: 0.00000
title: Mulliken charges with hydrogens summed into heavy atoms:
elementType: Cl Cl O N C C C C C C C
charge: 0.014912 0.018949 -0.041082 0.007742 0.629891 0.349281 -0.261440 -0.270373 -0.144158 -0.083225 -0.220497
polarizability: 1.26316945e+02 -8.71755764e+00 1.47082529e+02 -2.27899363e-03 -2.81522457e-03 3.84223300e+01
1716.lowfreq: -4.3149 -0.0028 -0.0028 -0.0011 8.0793 8.6565 71.1951 131.5956 152.3643
frequency: 71.1936 131.5954 152.3637 183.5504 195.3214 248.1026 259.2374 344.1930 379.8040 386.6126 438.9959 439.9782 487.2750 521.4349 605.2406 612.5429 698.1218 737.7252 768.0066 833.6581 869.4041 919.5152 1041.3024 1140.6134 1183.6366 1200.1746 1274.1740 1363.5233 1418.5750 1461.9121 1556.7428 1614.8043 2188.9357 3155.9538 3195.2384 3583.1320
redmass: 15.6161 15.9854 10.3847 21.7209 4.5826 8.3792 6.9080 19.8960 1.1318 13.4481 5.2587 11.7026 11.1803 5.0820 3.2064 6.9905 6.8994 5.2432 10.9432 1.5188 1.5058 8.9642 2.9805 1.3758 1.7120 1.9043 5.4653 4.4753 4.5129 4.1722 7.4145 7.4148 12.6239 1.0932 1.0936 1.0664
irintensity: 0.5993 1.4619 0.0030 0.0347 2.8186 3.6426 0.6956 1.1514 153.3114 5.3043 11.8661 0.0639 1.6813 2.2601 11.1664 6.8519 17.4506 12.6754 78.3968 26.8573 25.7675 55.7667 28.0231 219.8607 16.3625 5.8623 17.1794 53.2677 41.8757 47.5139 119.7330 241.2879 21.7563 1.9913 2.0836 78.9586
temp: 298.150 k
press: 1.00000 atm
elementType: 17 17 8 7 6 6 6 6 6 6 6 1 1 1
symmnumber: 1
zpe: 213309.7 jmol-1
zpe.correction: 0.081245 hartree
zpe.thermalcorrener: 0.091229 hartree
zpe.thermalcorrenthalpy: 0.092173 hartree
zpe.thermalcorrgfe: 0.045034 hartree
zpe.sumelectzpe: -1317.847738 hartree
zpe.sumelectthermal: -1317.837755 hartree
zpe.sumelectthermalent: -1317.836811 hartree
zpe.sumelectthermalfe: -1317.883949 hartree
dipole: -3.1780 5.5112 -0.0003
dipole: 6.3619
quadrupole: -69.7721 -84.5177 -77.6664
quadrupole: -4.1412 -0.0009 0.0018
quadrupole: 7.5466 -7.1990 -0.3477 -4.1412 -0.0009 0.0018
hfenergy: -1317.9289837 hartree
pointgroup: C01 [X(C7H3Cl2N1O1)]
dipole: -2.4161071 -0.6536164 -0.0001081 debye
dipolederiv: -0.1819459 0.2395459 0.0000017 0.2200631 -0.6041012 0.0000067 0.0000044 0.0000061 -0.0161852 -0.1713417 -0.2400194 0.0000174 -0.2092479 -0.6071233 0.0000332 0.000018 0.0000329 -0.0143173 -1.672813 -0.0524272 0.0000392 -0.0503713 -0.1184668 0.0000013 0.0000666 0.0000038 -0.4176786 -0.3634211 -0.0059517 0.0001727 0.0000267 -0.199865 0.0000005 0.000049 -0.0000006 -0.2295821 -0.3259972 -0.0165973 0.000005 0.008431 -0.4906837 0.000021 0.000011 0.0000215 0.1363446 1.6505033 0.077116 -0.0000519 0.0369034 0.4155166 -0.0000162 -0.0000612 -0.0000165 0.1223748 0.6398249 -0.2694832 -0.0000209 -0.1796511 1.0107199 -0.0000097 0.0000144 -0.0000278 -0.0394892 0.6488072 0.3121388 -0.0000405 0.1706936 1.0237439 -0.0000622 0.0000035 -0.0000417 -0.0575066 -0.6165517 0.1473906 0.0000048 0.406188 -0.3063658 -0.0000115 0.0000065 -0.0000093 -0.1654455 -0.5603922 -0.1874674 0.000017 -0.4027012 -0.2983001 0.0000222 0.0000284 0.0000214 -0.1268768 0.3830109 0.0104149 -0.0001521 0.0041712 0.0146505 -0.0000005 -0.0001245 -0.0000015 0.0398938 0.0203241 -0.056204 0.000006 -0.0580119 0.0240303 0.0000089 0.0000004 0.0000143 0.1867341 0.0856107 0.0263116 0.0000011 0.0313348 0.0562456 0.0000025 -0.0000056 -0.0000041 0.1837216 0.4643817 0.0152323 0.0000004 0.0221717 0.0799991 0.0000039 -0.0000108 0.0000016 0.3980124 unknown
polarizability: 150.0362231|2.4364555|123.3632509|0.002138|-0.0029237|38.42233 unknown
InChI: InChI=1S/C7H3Cl2NO/c8-6-1-4(11)2-7(9)5(6)3-10/h1-2,11H
charge 0 multiplicity 1
14 atoms
Cl 0.946802 -2.791957 0.0000
Cl 0.90378 2.787571 -0.000189
O  -3.445945 0.047573 0.000102
N  3.4232 0.016044 0.000297
C  0.794956 -0.002751 -0.000085
C  -2.054579 -0.022648 0.000041
C  0.055381 -1.218763 -0.00001
C  0.033132 1.204153 -0.000095
C  -1.347227 -1.250696 0.000052
C  -1.366227 1.213874 -0.000038
C  2.227704 0.008351 -0.000163
H  -1.872558 -2.211179 0.000109
H  -1.933104 2.146931 -0.000047
H  -3.862417 -0.850102 0.000126
