program: Gaussian 09
title: 000220788
version: EM64L-G09RevD.01
frameworkgroup: C1[X(C8H15Cl2NO)]
method: RPBEPBE
basis: SDD
operation: Freq
keyword: #p
keyword: freq=noraman
keyword: PBEPBE/SDD
title: #p freq=noraman PBEPBE/SDD
converged: NO YES NO NO
title: Mulliken charges:
elementType: Cl Cl O N C C C C C C C C H H H H H H H H H H H H H H H
charge: -0.000343 0.026458 -0.241208 -0.311783 -0.366200 -0.364043 -0.343841 -0.407199 -0.354177 -0.693216 0.367355 -0.698696 0.204388 0.181521 0.233141 0.204905 0.193905 0.185378 0.216208 0.257243 0.196980 0.192561 0.209405 0.211802 0.216548 0.324376 0.358531
chargesum: 0.00000
title: Mulliken charges with hydrogens summed into heavy atoms:
elementType: Cl Cl O N C C C C C C C C
charge: -0.000343 0.026458 -0.241208 0.012594 0.019709 0.074003 0.035442 0.066252 0.035364 -0.055461 0.367355 -0.340165
polarizability: 1.26725886e+02 2.37556797e+00 1.11238747e+02 4.38266029e+00 -5.12256888e-01 1.07368137e+02
1716.lowfreq: -8.8651 -7.7110 -0.0023 -0.0020 0.0017 5.4711 13.1430 21.7931 34.6318
frequency: 9.3686 21.4365 34.5328 54.4928 71.0688 108.1222 122.5171 132.7292 177.6802 189.4178 222.9288 229.9984 248.4265 312.1617 348.8286 377.3452 403.1950 499.4113 574.3987 605.4797 640.4896 680.6560 725.2698 742.9054 752.6276 804.2187 856.9711 883.0349 905.5932 942.3089 995.8439 1029.3140 1060.7141 1077.8068 1100.9112 1119.9365 1142.7440 1184.2802 1197.4701 1202.6082 1229.5170 1249.2720 1258.1877 1282.8742 1288.4650 1292.3958 1318.3504 1347.5809 1351.8446 1365.0040 1390.8329 1454.5603 1459.9056 1465.1958 1471.2134 1477.2591 1480.9455 1488.9305 1503.3771 1627.3391 2949.4196 2957.6662 2968.4296 2973.4927 2980.8484 2991.0303 3005.0894 3008.0760 3030.8832 3049.1733 3069.9718 3072.8870 3076.9854 3164.6400 3538.2681
redmass: 7.3104 6.5490 10.2810 1.6371 3.2426 3.7351 2.5110 2.2547 3.7011 4.6084 8.3359 1.1266 8.0350 2.4503 3.5171 13.0214 3.0947 2.3168 1.6088 3.1238 4.6901 5.2878 1.0886 2.1807 2.0450 1.6085 1.5395 2.3470 2.2213 1.6523 1.5349 3.0070 2.4927 2.3977 3.3753 2.4198 1.8733 1.0780 1.2617 1.5190 1.3771 1.8160 1.2842 1.2393 1.0879 1.1397 1.2749 1.3894 1.5755 1.3954 1.2169 1.1024 1.0811 1.0681 1.0730 1.0426 1.0754 1.0920 1.8368 8.0389 1.0595 1.0590 1.0597 1.0363 1.0627 1.0946 1.0807 1.0814 1.1029 1.1013 1.1007 1.0993 1.1044 1.0897 1.0780
irintensity: 1.3369 0.2911 6.6515 0.1513 0.7279 0.0193 0.6031 0.2458 5.9512 3.0974 0.4472 0.0058 3.4698 8.4156 6.6036 3.7883 2.8205 14.5889 10.0978 172.8257 35.2154 69.4452 15.8101 20.2689 17.5927 11.2578 1.6473 4.7571 1.3267 1.6086 0.9673 2.4012 10.7292 2.3695 7.1862 6.1761 1.1799 13.4126 8.9711 2.3733 2.9599 17.4908 3.6527 19.3625 2.9320 1.9792 9.1510 1.8446 0.4878 4.7991 12.0860 28.7413 4.5789 0.5876 1.1110 12.7604 4.2591 23.1345 148.9157 222.7855 10.6068 7.0539 75.2936 34.7194 42.6657 7.4665 18.5972 12.0920 21.2201 77.4801 87.9984 50.5040 18.9305 0.6810 31.9271
temp: 298.150 k
press: 1.00000 atm
elementType: 17 17 8 7 6 6 6 6 6 6 6 6 1 1 1 1 1 1 1 1 1 1 1 1 1 1 1
symmnumber: 1
zpe: 582755.8 jmol-1
zpe.correction: 0.221960 hartree
zpe.thermalcorrener: 0.237113 hartree
zpe.thermalcorrenthalpy: 0.238057 hartree
zpe.thermalcorrgfe: 0.175029 hartree
zpe.sumelectzpe: -1362.980900 hartree
zpe.sumelectthermal: -1362.965747 hartree
zpe.sumelectthermalent: -1362.964802 hartree
zpe.sumelectthermalfe: -1363.027830 hartree
dipole: -2.0269 0.6041 2.3703
dipole: 3.1768
quadrupole: -88.9857 -89.7124 -91.3019
quadrupole: -2.5435 0.9444 5.2317
quadrupole: 1.0143 0.2877 -1.3019 -2.5435 0.9444 5.2317
hfenergy: -1363.2028595 hartree
pointgroup: C01 [X(C8H15Cl2N1O1)]
dipole: -0.9122476 0.3298528 0.7880903 debye
polarizability: 125.2289537|1.8569338|110.9352634|6.9701483|-0.6685568|109.1685527 unknown
InChI: InChI=1S/C8H15Cl2NO/c1-2-3-4-5-6-11-8(12)7(9)10/h7,11H,2-6H2,1H3
charge 0 multiplicity 1
27 atoms
Cl 3.312513 -0.967815 2.180241
Cl 1.947176 -2.35011 -0.204962
O  2.398953 1.051786 -1.069621
N  1.104953 0.783101 0.862889
C  -1.938913 0.461299 0.424175
C  -1.032727 1.511931 -0.255613
C  -3.197617 0.126421 -0.407087
C  0.200017 1.916327 0.58652
C  -4.105602 -0.931519 0.26172
C  -5.364515 -1.256611 -0.570622
C  2.105647 0.433381 -0.001465
C  2.904229 -0.832697 0.345379
H  -1.36169 -0.470532 0.595847
H  -2.251338 0.832233 1.423942
H  -0.685446 1.134308 -1.236667
H  -1.617916 2.431764 -0.458921
H  -2.889104 -0.237488 -1.409128
H  -3.782744 1.054002 -0.579527
H  -0.119633 2.340986 1.556374
H  0.785391 2.681379 0.04669
H  -3.521078 -1.859228 0.428505
H  -4.408092 -0.569611 1.265905
H  -5.981871 -0.351712 -0.726038
H  -5.089778 -1.64999 -1.567479
H  -5.995504 -2.014317 -0.070796
H  0.975457 0.227683 1.711613
H  3.856331 -0.848569 -0.196172
