program: Gaussian 09
title: 000220791
version: EM64L-G09RevD.01
frameworkgroup: C1[X(C12H23IO2)]
method: RPBEPBE
basis: SDD
operation: Freq
keyword: #p
keyword: freq=noraman
keyword: PBEPBE/SDD
title: #p freq=noraman PBEPBE/SDD
converged: YES YES NO NO
title: Mulliken charges:
elementType: I O O C C C C C C C C C C C C H H H H H H H H H H H H H H H H H H H H H H H
charge: 0.083657 -0.243237 -0.224461 -0.382824 -0.381586 -0.381256 -0.372637 -0.379438 -0.353355 -0.394096 -0.356517 -0.283738 -0.696156 0.365509 -0.862366 0.194451 0.193881 0.192655 0.193091 0.197356 0.196124 0.190097 0.189754 0.197386 0.195576 0.187833 0.188055 0.213536 0.218868 0.195047 0.194865 0.232292 0.235084 0.209788 0.209655 0.215521 0.311705 0.309881
chargesum: 0.00000
title: Mulliken charges with hydrogens summed into heavy atoms:
elementType: I O O C C C C C C C C C C C C
charge: 0.083657 -0.243237 -0.224461 0.005508 0.004159 0.012224 0.007213 0.013525 0.022533 0.038308 0.033395 0.183638 -0.061191 0.365509 -0.240779
polarizability: 2.06169093e+02 9.08151201e+00 1.47361807e+02 4.75357316e+00 4.28491378e+00 1.23208368e+02
1716.lowfreq: -32.1761 -5.5447 -0.0012 -0.0007 0.0002 0.3382 5.6855 10.0941 20.8672
frequency: -27.8015 5.6908 20.7268 29.0887 42.4357 50.6596 69.2593 79.4012 91.6498 105.9324 116.4442 140.5223 144.5932 146.3079 161.7555 202.3961 221.1936 229.2851 301.8066 323.6004 406.1826 413.8615 461.0381 485.7615 487.7110 628.7613 716.7817 717.7757 720.7314 731.7386 753.2351 788.3700 813.8981 838.8827 878.2020 887.7495 900.9629 947.2407 964.1335 988.3700 1002.0091 1016.5688 1032.5436 1054.3296 1068.4974 1075.3366 1079.6788 1081.5040 1095.8248 1125.8998 1148.6904 1182.6155 1197.0370 1208.9744 1209.5176 1222.7809 1238.6765 1245.3705 1264.2015 1274.0894 1277.6023 1279.9711 1285.5090 1291.3494 1294.0868 1308.4609 1334.7165 1351.0779 1353.7777 1357.2023 1371.8824 1387.7731 1421.3653 1459.4415 1459.7937 1463.1289 1465.4496 1467.4689 1471.6490 1475.3273 1477.0527 1482.5142 1487.2408 1489.0893 1629.9209 2949.2993 2949.7715 2952.4441 2954.6655 2958.7797 2964.8374 2968.2660 2971.1568 2982.6800 2987.8380 2990.9664 2994.9743 3001.9200 3004.5408 3017.2663 3029.8003 3039.8051 3047.8637 3067.6194 3069.9144 3076.8114 3086.5895 3184.8909
redmass: 1.6764 5.7667 5.0504 4.2774 5.1740 1.5896 3.6988 3.8426 2.1431 2.9200 2.2545 2.0759 2.0978 3.9776 4.2506 4.4978 1.1324 3.4718 4.0506 3.1056 3.2927 3.1180 6.6840 3.3206 2.9722 5.2831 1.1007 5.5245 1.0783 1.0913 1.1202 1.1689 2.7020 1.2080 2.4828 1.8999 1.2143 7.4536 1.1749 4.9353 4.1152 1.0845 3.6950 3.0226 2.7923 1.5833 2.0785 2.1207 2.3345 3.1489 1.4432 1.7694 1.1711 1.4211 1.3273 2.6035 1.3392 1.3057 1.2284 1.0428 1.3005 1.0995 1.0937 1.1165 1.1089 1.3346 1.4038 1.5471 1.6722 1.6252 1.5459 1.2170 1.1270 1.0737 1.0731 1.0696 1.0741 1.0793 1.0820 1.0426 1.0824 1.0868 1.0900 1.0976 10.4877 1.0587 1.0587 1.0592 1.0590 1.0592 1.0588 1.0584 1.0366 1.0964 1.0978 1.0600 1.0999 1.0565 1.1023 1.1041 1.1046 1.1044 1.1045 1.1007 1.0993 1.1080 1.0555 1.1119
irintensity: 0.0451 0.2284 0.2993 0.2852 0.6747 0.1342 0.1500 0.6584 0.1298 0.0803 0.0682 0.1997 0.0223 2.2247 0.2831 4.0365 0.0118 3.5510 6.4179 1.4563 6.1938 0.6837 11.9790 1.7865 2.1702 10.6388 14.6230 2.6198 0.0528 6.0791 0.0321 1.2558 3.1566 0.5345 10.6456 4.8681 0.2291 73.9402 0.6790 11.1866 0.6025 0.0362 10.4173 4.1935 2.3222 174.6452 1.6763 17.2673 11.9056 4.3433 1.5393 0.0950 14.2577 1.8391 10.9225 313.8917 0.8730 5.6067 0.1077 0.0320 3.1514 0.3357 0.3178 0.0483 0.0642 1.2974 0.3188 0.1910 0.2817 0.8697 5.5304 11.0774 22.7505 0.0121 0.0230 0.0252 0.1024 1.2114 0.1700 12.4038 2.5216 0.3948 2.1941 40.9785 213.1139 0.1047 0.1003 0.2538 2.0811 3.0834 41.0576 200.4158 36.2530 0.0331 0.1504 17.3859 0.3862 36.3804 0.4868 2.9380 0.1437 135.0055 63.8147 96.4179 54.9331 73.5465 4.9655 0.0516
temp: 298.150 k
press: 1.00000 atm
elementType: 53 8 8 6 6 6 6 6 6 6 6 6 6 6 6 1 1 1 1 1 1 1 1 1 1 1 1 1 1 1 1 1 1 1 1 1 1 1
symmnumber: 1
zpe: 862709.9 jmol-1
zpe.correction: 0.328589 hartree
zpe.thermalcorrener: 0.347696 hartree
zpe.thermalcorrenthalpy: 0.348640 hartree
zpe.thermalcorrgfe: 0.274112 hartree
zpe.sumelectzpe: -631.798422 hartree
zpe.sumelectthermal: -631.779316 hartree
zpe.sumelectthermalent: -631.778372 hartree
zpe.sumelectthermalfe: -631.852899 hartree
dipole: 2.3767 -0.1978 1.5337
dipole: 2.8355
quadrupole: -115.1129 -112.2546 -108.4456
quadrupole: 3.4504 -7.9971 6.4541
quadrupole: -3.1752 -0.3170 3.4921 3.4504 -7.9971 6.4541
hfenergy: -632.1270113 hartree
pointgroup: C01 [X(C12H23I1O2)]
dipole: 0.9256579 0.4322777 -0.4480754 debye
polarizability: 202.409864|-6.8009046|130.2280061|-16.1854711|12.9926425|144.1013978 unknown
InChI: InChI=1S/C12H23IO2/c1-2-3-4-5-6-7-8-9-10-15-12(14)11-13/h2-11H2,1H3
charge 0 multiplicity 1
38 atoms
I  -6.864683 1.363849 2.079156
O  -4.047064 0.47158 -0.117076
O  -5.480619 -1.370607 -0.212758
C  2.25076 -0.446965 -0.05178
C  3.540818 0.401866 0.006659
C  0.960324 0.402869 -0.043605
C  4.832098 -0.44732 0.001117
C  -0.32808 -0.448354 -0.103672
C  6.123046 0.400238 0.059643
C  -1.613138 0.413098 -0.087168
C  7.414365 -0.449788 0.052682
C  -2.869551 -0.453169 -0.151484
C  8.69902 0.40478 0.11306
C  -5.298869 -0.134303 -0.127276
C  -6.391515 0.908862 -0.03918
H  2.234358 -1.147155 0.80955
H  2.268948 -1.078257 -0.964862
H  3.558881 1.101247 -0.855372
H  3.522662 1.034353 0.918908
H  0.941516 1.03228 0.870321
H  0.977029 1.103777 -0.904017
H  4.814333 -1.14672 0.863229
H  4.850624 -1.080043 -0.911098
H  -0.340571 -1.151859 0.754535
H  -0.309665 -1.073877 -1.020385
H  6.142441 1.100473 -0.801798
H  6.107054 1.03222 0.972419
H  -1.607775 1.113263 -0.944589
H  -1.642264 1.028494 0.832328
H  7.393564 -1.149965 0.912788
H  7.429765 -1.080056 -0.860064
H  -2.923982 -1.049508 -1.081191
H  -2.950757 -1.144159 0.70814
H  8.721956 1.020576 1.032132
H  8.757981 1.092641 -0.751658
H  9.607337 -0.225602 0.105995
H  -7.328212 0.526251 -0.463309
H  -6.085537 1.867591 -0.477416
