program: Gaussian 09
title: 000220818
version: EM64L-G09RevD.01
frameworkgroup: C1[X(C20H10I2O5)]
method: RPBEPBE
basis: SDD
operation: Freq
keyword: #p
keyword: freq=noraman
keyword: PBEPBE/SDD
title: #p freq=noraman PBEPBE/SDD
converged: YES YES NO NO
title: Mulliken charges:
elementType: I I O O O O O C C C C C C C C C C C C C C C C C C C C H H H H H H H H H H
charge: 0.186173 0.151228 -0.267347 -0.386362 -0.224137 -0.438875 -0.229072 0.254251 0.246657 0.231271 0.193244 0.360252 0.401585 -0.348981 -0.312225 0.092349 -0.804895 -0.785428 -0.370780 -0.378497 0.424313 -0.347087 0.245311 -0.331322 -0.224408 -0.223767 0.081832 0.255589 0.249313 0.267344 0.264593 0.255582 0.287918 0.244053 0.242790 0.344102 0.393434
chargesum: 0.00000
title: Mulliken charges with hydrogens summed into heavy atoms:
elementType: I I O O O O O C C C C C C C C C C C C C C C C C C C C
charge: 0.186173 0.151228 -0.267347 -0.042260 -0.224137 -0.045441 -0.229072 0.254251 0.246657 0.231271 0.193244 0.360252 0.401585 -0.093392 -0.062911 0.092349 -0.804895 -0.785428 -0.103437 -0.113904 0.424313 -0.091505 0.245311 -0.043403 0.019645 0.019022 0.081832
polarizability: 4.12210241e+02 2.61348387e+01 4.01252294e+02 -2.36188000e+01 1.28581532e+00 1.67210884e+02
1716.lowfreq: -3.6456 -0.0006 -0.0004 -0.0003 4.8692 5.4726 14.8095 26.9053 30.1845
frequency: 14.7274 26.8071 30.1809 46.6109 52.5968 55.6622 67.9957 99.1797 107.6877 114.5067 123.3452 130.6017 162.0920 200.7047 217.6200 220.2613 236.2747 255.4006 284.8843 293.4108 302.2935 320.2892 335.8295 384.8478 388.0357 416.1431 457.8886 473.1851 485.7698 497.7978 503.6283 517.8360 518.8175 575.0443 585.9907 593.9362 594.2114 607.3244 615.6891 618.3983 627.6766 669.2999 691.2256 706.1219 730.5192 751.1646 758.5258 769.0126 771.1106 782.8226 795.1532 827.3841 838.1456 896.0663 921.3413 925.6659 945.9626 958.2226 979.8866 981.7532 1002.2062 1009.5429 1012.9464 1041.6076 1086.3465 1101.9479 1124.7564 1145.2316 1161.4668 1169.6725 1180.5709 1189.3471 1219.0330 1270.3151 1273.3919 1310.9271 1317.8906 1318.3105 1362.0340 1368.9502 1372.1198 1409.7455 1423.9426 1429.7213 1465.1406 1480.1374 1500.2769 1536.3670 1546.9553 1565.3894 1575.5910 1596.1658 1601.6237 1633.2122 1639.2931 3138.4226 3141.9109 3151.6934 3156.9064 3166.4771 3168.1419 3184.4342 3184.5526 3415.0812 3532.0253
redmass: 7.8396 8.4230 13.1139 7.5434 10.1514 66.3539 8.9054 6.5918 17.9144 11.4599 4.7744 5.6768 8.0610 14.9357 10.2420 7.1047 7.2278 5.0284 8.0018 5.8355 9.4438 6.5347 8.6837 7.3869 7.6866 3.1587 6.4411 5.7596 5.0896 1.1984 4.4684 4.7897 4.5931 6.3254 5.8438 2.7623 1.7877 5.4764 4.4114 5.9793 6.4609 3.8018 3.8237 6.4352 7.9438 6.3589 5.0515 5.0062 3.7780 5.9604 1.9205 1.5675 1.8223 1.6180 5.8405 5.7107 6.3096 1.3406 1.3671 1.3432 5.3593 1.3603 4.2794 2.4002 2.5867 2.2385 1.8434 1.7926 1.7565 1.8062 1.0784 1.9540 2.5943 2.0943 1.8450 2.2381 3.2298 2.5646 2.4292 4.4652 6.7799 6.8388 3.9950 2.6099 3.4350 4.3762 7.0616 8.5826 7.4340 7.8929 7.2912 7.2804 6.3186 8.2005 8.6607 1.0867 1.0868 1.0915 1.0889 1.0968 1.0983 1.0972 1.0964 1.0647 1.0643
irintensity: 0.0921 0.2417 0.0895 0.9965 0.4617 0.0598 0.2841 3.9516 0.1568 0.5624 0.8616 1.9875 0.9612 0.7465 2.9198 3.6950 0.0537 0.8067 0.6119 0.4223 1.5675 4.2431 0.9697 5.7342 6.1286 3.7922 53.8620 4.0810 25.8425 128.1534 11.5360 8.3715 5.6429 4.5331 54.0283 48.4915 62.7382 7.2477 0.3676 1.4821 3.5099 8.2344 66.7515 10.7410 13.9643 5.7490 12.8260 6.6992 6.7968 19.4906 20.2242 19.2809 36.8251 15.6612 17.5505 38.9273 14.7117 0.5409 1.9033 2.0071 317.7396 0.2734 7.4852 20.7491 82.4814 70.4068 45.2176 70.7442 67.3022 319.1379 1.2473 12.1888 12.1254 4.4180 10.9815 8.9967 25.7950 90.1013 133.6308 20.4728 25.4038 58.6983 4.9690 26.2470 49.6050 92.5681 270.5305 82.5946 9.0341 16.6850 21.1381 450.3503 10.1538 98.8800 194.9494 1.1836 2.4925 10.1249 3.4393 12.6719 13.7055 8.0246 2.8874 87.6079 63.3260
temp: 298.150 k
press: 1.00000 atm
elementType: 53 53 8 8 8 8 8 6 6 6 6 6 6 6 6 6 6 6 6 6 6 6 6 6 6 6 6 1 1 1 1 1 1 1 1 1 1
symmnumber: 1
zpe: 643246.3 jmol-1
zpe.correction: 0.245000 hartree
zpe.thermalcorrener: 0.268339 hartree
zpe.thermalcorrenthalpy: 0.269284 hartree
zpe.thermalcorrgfe: 0.187995 hartree
zpe.sumelectzpe: -1165.416287 hartree
zpe.sumelectthermal: -1165.392947 hartree
zpe.sumelectthermalent: -1165.392003 hartree
zpe.sumelectthermalfe: -1165.473292 hartree
dipole: 7.4948 6.1940 -1.2155
dipole: 9.7988
quadrupole: -141.3915 -207.9254 -172.8240
quadrupole: -17.7918 -4.3758 2.1432
quadrupole: 32.6555 -33.8784 1.2229 -17.7918 -4.3758 2.1432
hfenergy: -1165.6612862 hartree
pointgroup: C01 [X(C20H10I2O5)]
dipole: 2.3779913 -3.0164515 0.3290215 debye
polarizability: 400.729997|-27.5064738|411.9103949|24.0586375|10.1137855|168.033027 unknown
InChI: InChI=1S/C20H10I2O5/c21-16-13(23)7-5-11-15(9-3-1-2-4-10(9)20(25)26)12-6-8-14(24)17(22)19(12)27-18(11)16/h1-8,23,25H
charge 0 multiplicity 1
37 atoms
I  -4.871344 -1.379078 -0.233897
I  -4.014104 3.185548 -0.030361
O  -2.298611 0.471479 0.0732
O  -3.260434 -4.286044 -0.103413
O  -1.472244 5.223454 0.287654
O  3.353016 -0.8097 -2.912904
O  1.154562 -0.356514 -2.335184
C  0.493407 -0.035504 0.335597
C  -0.445604 -1.137174 0.239123
C  0.02562 1.285621 0.336385
C  1.954651 -0.330774 0.515474
C  -1.837134 -0.839983 0.099556
C  -1.403188 1.555926 0.199038
C  -0.061762 -2.510125 0.264311
C  0.898038 2.440214 0.441708
C  2.842379 -0.598146 -0.572199
C  -2.802133 -1.861124 -0.016701
C  -1.928019 2.836511 0.17913
C  2.473989 -0.350518 1.834054
C  -1.005986 -3.532502 0.152136
C  -2.385524 -3.217601 0.006753
C  0.397903 3.719146 0.423932
C  -1.047224 4.018211 0.296089
C  4.212372 -0.87468 -0.319321
C  3.836882 -0.630035 2.078443
C  4.709815 -0.894499 0.99835
C  2.336897 -0.568345 -1.975173
H  0.996877 -2.762581 0.374325
H  1.974821 2.266928 0.534558
H  1.798645 -0.142506 2.670541
H  -0.722198 -4.587715 0.168657
H  1.051129 4.594751 0.501448
H  4.870482 -1.068013 -1.170171
H  4.21292 -0.637888 3.107031
H  5.767393 -1.109416 1.182159
H  -4.199086 -3.96192 -0.20631
H  2.960596 -0.771405 -3.826217
