program: Gaussian 09
title: 000018743
version: EM64L-G09RevD.01
frameworkgroup: C1[X(C7H16N)]
method: RPBEPBE
basis: SDD
operation: Freq
keyword: #p
keyword: freq=noraman
keyword: PBEPBE/SDD
title: #p freq=noraman PBEPBE/SDD
converged: YES YES NO NO
title: Mulliken charges:
elementType: N C C C C C C C H H H H H H H H H H H H H H H H
charge: -0.093535 -0.344833 -0.344828 -0.433581 -0.433585 -0.400581 -0.558890 -0.542820 0.260168 0.267484 0.267483 0.260169 0.264255 0.239594 0.239591 0.264255 0.265250 0.217729 0.275263 0.265573 0.265576 0.267064 0.266600 0.266599
chargesum: 1.00000
title: Mulliken charges with hydrogens summed into heavy atoms:
elementType: N C C C C C C C
charge: -0.093535 0.182819 0.182824 0.070268 0.070261 0.082399 0.247521 0.257443
polarizability: 8.21154803e+01 -1.07134992e-05 7.43568930e+01 -1.66470646e-01 -2.46993027e-05 6.92785778e+01
1716.lowfreq: -41.3046 -16.4853 -0.0008 -0.0008 -0.0004 12.3550 135.9895 146.2761 232.0027
frequency: 135.9881 146.2272 231.9502 256.8019 299.7637 315.5885 341.6536 416.3616 426.5314 452.9954 460.6055 548.6314 671.3888 766.4617 825.1301 853.4956 861.0745 889.2312 929.9837 947.0482 975.5181 1001.9709 1045.7077 1085.1166 1089.5287 1112.0643 1131.6332 1177.7151 1179.1009 1202.0085 1242.3818 1264.5447 1295.8234 1309.9176 1339.6673 1351.9378 1356.4012 1363.8282 1370.9807 1418.5474 1442.1122 1450.7084 1454.2482 1459.6124 1470.6026 1474.8150 1475.3913 1481.3867 1485.9694 1497.2605 2996.0346 3006.7053 3007.4572 3015.9080 3018.2448 3022.8890 3033.1482 3062.5753 3064.2540 3079.0023 3090.5951 3095.9959 3137.0759 3141.8711 3141.8767 3169.8583
redmass: 1.1231 2.3974 1.1782 1.5148 2.0260 2.5540 1.8834 2.2947 2.0475 2.7171 3.0394 1.6985 3.4185 1.6231 2.3112 1.6811 2.2088 3.0249 1.5589 2.3120 1.8535 1.9359 2.0293 1.2363 1.6291 1.9569 1.1297 2.2195 1.3288 1.6364 1.6447 1.2692 1.2100 1.4579 1.2907 1.3840 1.3929 1.4151 1.3021 1.1485 1.1465 1.0603 1.0736 1.0658 1.0857 1.0555 1.0689 1.0606 1.0912 1.0583 1.0680 1.0627 1.0621 1.0594 1.0555 1.0369 1.0349 1.0999 1.0973 1.1007 1.1072 1.1080 1.1056 1.1049 1.1049 1.1020
irintensity: 0.0696 0.3487 0.0278 0.0092 0.0826 1.0674 0.2976 0.0308 0.1373 0.2429 0.0189 3.4783 0.9180 1.4746 1.9557 11.0470 3.0563 31.6101 24.5552 10.9037 8.3798 9.8505 0.9999 0.0052 2.5269 0.0843 0.9871 1.3400 2.5375 0.7233 0.2974 5.4035 5.0867 3.1749 0.6160 0.0582 1.2489 1.2266 0.5833 16.6251 4.5602 1.3996 2.6738 16.6971 32.8295 30.3765 26.1270 53.2573 23.9522 30.8203 10.6774 10.1495 19.6138 4.9854 6.6720 10.4273 4.1045 7.6938 11.4565 17.9802 3.0780 21.1666 0.0145 5.1966 6.5163 3.6845
temp: 298.150 k
press: 1.00000 atm
elementType: 7 6 6 6 6 6 6 6 1 1 1 1 1 1 1 1 1 1 1 1 1 1 1 1
symmnumber: 1
zpe: 591355.4 jmol-1
zpe.correction: 0.225235 hartree
zpe.thermalcorrener: 0.233829 hartree
zpe.thermalcorrenthalpy: 0.234774 hartree
zpe.thermalcorrgfe: 0.193084 hartree
zpe.sumelectzpe: -330.176113 hartree
zpe.sumelectthermal: -330.167519 hartree
zpe.sumelectthermalent: -330.166575 hartree
zpe.sumelectthermalfe: -330.208265 hartree
dipole: -2.5458 0.0000 -0.0554
dipole: 2.5464
quadrupole: -36.0992 -42.1725 -43.1685
quadrupole: 0.0000 -0.0547 0.0000
quadrupole: 4.3808 -1.6924 -2.6884 0.0000 -0.0547 0.0000
hfenergy: -330.4013485 hartree
pointgroup: C01 [X(C7H16N1)]
dipole: 1.0013518 0.0000023 -0.0311056 debye
dipolederiv: -0.4709723 0.000001 0.0187391 0.0000022 -0.3768147 0.0000015 0.0056289 0.0000046 -0.3171946 0.2542603 -0.1729054 0.056807 -0.2211372 0.3348209 -0.0522749 0.0488348 -0.0865806 0.1340838 0.2542551 0.172912 0.0567827 0.2211452 0.3348438 0.0522474 0.0488009 0.0865521 0.1340596 -0.011853 0.0430615 0.0007166 0.0709526 -0.0360665 0.0046323 -0.0112032 0.0356151 0.127703 -0.0118512 -0.043062 0.0007187 -0.0709555 -0.0360747 -0.0046114 -0.0111969 -0.0355953 0.1277124 0.0368445 0.0000013 0.0187129 0.0000043 0.0813399 0.0000021 0.0731914 0.0000019 0.1210131 0.0605244 0.0000042 0.0663152 -0.0000017 0.0624698 0.0000192 0.083516 0.0000176 0.2784332 0.2729391 -0.0000094 -0.1086031 -0.0000076 0.0760675 0.0000047 -0.1457592 0.0000029 0.1394226 0.0682969 0.0332626 0.0089223 0.0508327 0.0686213 -0.0574353 0.0206443 0.0016059 -0.0800335 -0.0437425 -0.0990701 -0.0366556 -0.0477762 0.0027294 -0.0104933 -0.0547995 -0.0404998 0.0863756 -0.0437422 0.0990631 -0.0366715 0.0477667 0.0027386 0.0105067 -0.0548072 0.0405126 0.0863679 0.0682953 -0.0332599 0.0089291 -0.0508298 0.0686293 0.0574108 0.0206552 -0.0016302 -0.0800393 0.0482334 0.0564025 -0.0142832 0.0421413 -0.0473557 0.0446378 -0.0196166 0.065065 0.083284 0.0486862 -0.0473711 -0.034603 -0.0547903 0.0939802 0.0095992 -0.0148079 -0.0407012 -0.1277359 0.0486855 0.0473655 -0.0346071 0.0547875 0.0939851 -0.0096278 -0.0148131 0.0406729 -0.127743 0.048236 -0.0564024 -0.0142749 -0.042142 -0.0473687 -0.0446213 -0.0196106 -0.0650498 0.0832971 -0.0857356 0.0000032 0.0602224 0.000005 0.0640978 0.0000011 0.0886987 0.000001 0.0690142 0.103029 0.0000007 0.0087407 -0.000003 0.0243499 -0.0000091 -0.0576484 -0.0000097 -0.1353067 -0.0054435 -0.0000066 0.0884016 -0.0000062 0.1268336 0.000003 0.0476858 -0.0000014 0.0688943 0.0783767 0.0677047 -0.028698 0.0914095 -0.0045692 0.0239624 0.0093704 -0.0294634 0.0886316 0.0784094 -0.0676928 -0.0286811 -0.0913944 -0.0045975 -0.0239572 0.0093753 0.0294755 0.0886267 0.0653414 -0.000002 -0.0885739 -0.0000009 0.128371 -0.0000044 -0.0215366 -0.0000048 -0.027287 0.0694621 -0.0236242 0.015822 -0.0850259 -0.0055177 -0.0444154 -0.015299 -0.0733449 0.0892153 0.0694652 0.0236236 0.0158214 0.0850237 -0.0055134 0.0444219 -0.0153035 0.073354 0.0892056 unknown
polarizability: 82.1174653|0.0000371|74.356893|0.0471956|-0.0002978|69.2765929 unknown
InChI: InChI=1S/C7H16N/c1-8(2)6-4-3-5-7-8/h3-7H2,1-2H3
charge 1 multiplicity 1
24 atoms
N  0.928515 -0.000012 -0.012033
C  0.120347 1.264521 -0.405965
C  0.120364 -1.264613 -0.405778
C  -1.300217 1.272926 0.181118
C  -1.300212 -1.272946 0.181282
C  -2.084285 -0.000036 -0.210424
C  1.239388 0.000102 1.48185
C  2.246819 -0.000058 -0.781469
H  0.081329 1.260618 -1.51024
H  0.714611 2.1346 -0.076831
H  0.714628 -2.134636 -0.076493
H  0.081369 -1.260884 -1.510054
H  -1.805981 2.173363 -0.212739
H  -1.273381 1.395331 1.279904
H  -1.273394 -1.395211 1.280083
H  -1.805963 -2.173434 -0.212471
H  -3.071788 -0.000009 0.281291
H  -2.272847 -0.000104 -1.3022
H  0.307733 0.00004 2.061427
H  1.824914 -0.900578 1.722641
H  1.824729 0.900928 1.722545
H  2.036359 -0.000086 -1.861836
H  2.821899 0.900636 -0.51608
H  2.821866 -0.900759 -0.516029
