program: Gaussian 09
title: 000220780
version: EM64L-G09RevD.01
frameworkgroup: C1[X(C7H8ClN5)]
method: RPBEPBE
basis: SDD
operation: Freq
keyword: #p
keyword: freq=noraman
keyword: PBEPBE/SDD
title: #p freq=noraman PBEPBE/SDD
converged: NO NO NO NO
title: Mulliken charges:
elementType: Cl N N N N N C C C C C C C H H H H H H H H
charge: -0.012320 -0.173422 -0.011232 -0.366487 0.037107 0.002209 0.027582 0.179658 0.226443 -0.411238 -0.610621 -0.350816 -0.601905 0.260269 0.247768 0.247731 0.264505 0.319995 0.258111 0.258063 0.208601
chargesum: 0.00000
title: Mulliken charges with hydrogens summed into heavy atoms:
elementType: Cl N N N N N C C C C C C C
charge: -0.012320 -0.173422 -0.011232 -0.046492 0.037107 0.002209 0.027582 0.179658 0.226443 -0.150969 0.149382 -0.350816 0.122871
polarizability: 1.66237422e+02 2.97374799e-01 1.47864296e+02 -2.00313747e-02 -2.26358544e-04 5.61409072e+01
1716.lowfreq: -9.5040 -4.4781 -3.9262 -0.0012 0.0005 0.0027 36.3579 74.4073 97.3866
frequency: 36.2722 74.4030 97.3838 111.4932 152.1067 165.1468 180.0961 203.4246 270.4885 319.1343 345.4811 350.7327 367.5337 461.3063 504.3648 528.5763 619.0861 659.4877 662.0531 677.8837 718.4273 776.8940 781.5650 825.1331 884.3365 947.6432 979.0763 1089.1882 1107.1302 1121.7147 1129.0263 1173.5708 1189.9260 1224.2078 1251.0221 1309.9769 1365.5891 1374.7194 1406.3355 1417.7974 1440.2896 1454.9524 1458.0426 1468.1061 1477.6606 1493.8845 1502.8267 1550.9501 1601.9380 2997.4402 3007.8493 3082.0878 3102.1577 3113.6417 3127.7362 3213.7362 3589.7416
redmass: 1.0297 3.3303 1.1904 4.1110 3.7265 3.4268 4.5382 4.8781 5.9129 4.5878 7.9098 5.0350 10.0483 1.1935 8.4169 4.8150 6.8470 9.8085 10.2204 6.7795 6.2849 7.3827 3.5633 1.6926 7.3516 4.0714 3.2353 2.2003 4.8351 1.2853 1.3116 1.7740 2.4994 2.5032 6.9900 7.5203 4.3558 6.7226 1.9507 1.6754 1.4035 1.0404 1.6040 1.0427 1.4715 1.4571 1.7041 6.0410 5.8134 1.0336 1.0329 1.1015 1.1027 1.1021 1.1020 1.0974 1.0781
irintensity: 0.3212 3.6325 0.0430 0.9391 2.0532 0.9499 3.8923 2.0033 12.3669 3.1926 2.5089 5.2534 6.3867 100.4076 7.0736 0.4670 1.0352 2.1086 1.4732 27.0283 4.6825 15.2367 26.9033 13.7610 92.6143 20.9984 1.5245 33.8123 56.9837 1.3224 0.9715 9.1955 70.4879 1.6118 62.5125 177.0305 21.4271 163.2190 17.3619 7.7593 47.0217 14.6047 14.5229 17.0763 17.3930 26.2675 4.4406 194.7791 609.3447 55.2312 41.5942 21.9464 17.1754 21.1269 3.1616 2.8576 60.4672
temp: 298.150 k
press: 1.00000 atm
elementType: 17 7 7 7 7 7 6 6 6 6 6 6 6 1 1 1 1 1 1 1 1
symmnumber: 1
zpe: 403995.5 jmol-1
zpe.correction: 0.153874 hartree
zpe.thermalcorrener: 0.166083 hartree
zpe.thermalcorrenthalpy: 0.167027 hartree
zpe.thermalcorrgfe: 0.114245 hartree
zpe.sumelectzpe: -1004.409935 hartree
zpe.sumelectthermal: -1004.397726 hartree
zpe.sumelectthermalent: -1004.396782 hartree
zpe.sumelectthermalfe: -1004.449564 hartree
dipole: -0.2974 -4.5804 0.0011
dipole: 4.5901
quadrupole: -80.1705 -73.7616 -83.5803
quadrupole: -15.7077 -0.0011 0.0006
quadrupole: -0.9997 5.4092 -4.4095 -15.7077 -0.0011 0.0006
hfenergy: -1004.5638088 hartree
pointgroup: C01 [X(C7H8Cl1N5)]
dipole: -0.2616319 -1.7868232 -0.0004214 debye
dipolederiv: -0.2654513 0.311549 0.0000344 0.3206398 -0.8678684 -0.0000704 -0.0000254 0.0000589 -0.0854594 -0.4515557 0.1674579 0.0002971 -0.2405916 -0.3295245 0.0000916 -0.000776 -0.0001945 -0.1170717 -0.5158097 0.1071103 0.0000812 0.3800388 0.069955 -0.0000543 0.0001505 -0.0000146 -0.200909 -1.0163533 -0.4497904 0.0000997 -0.8509006 -0.8317133 0.0000374 -0.0002938 -0.0002392 -0.4684894 -1.1488184 0.405112 0.0001776 0.1543949 -0.8042383 -0.0000927 0.0001285 -0.0000312 -0.1524896 -0.6210173 -0.1822175 0.0001119 -0.5024945 -1.4697239 -0.0000181 0.0000029 -0.0000408 -0.1831348 -0.7998832 -0.2402094 0.0000398 -0.1324406 -0.3561509 0.0000934 0.0001209 -0.0000031 -0.0017794 0.8186234 -0.2243431 -0.0002469 -0.1128575 0.4344304 0.0000526 0.0000555 0.000164 0.087276 1.2909456 0.4581875 -0.0001138 0.9685695 1.3467024 0.0000246 0.0000247 0.0000756 0.2254895 0.0704984 -0.1701427 0.0001164 -0.2416449 0.1648776 0.0000708 -0.0000292 -0.0000524 -0.1157053 0.4869996 0.1137591 -0.000524 0.2774968 0.126976 -0.0004024 -0.0000912 -0.0002414 0.2046208 1.3969693 -0.2853544 -0.0002095 -0.1118386 1.945397 0.0000902 -0.0000749 -0.0000474 0.0059441 0.6095699 0.1025729 -0.0001618 -0.0234031 0.188501 0.0000793 -0.0000345 0.0001407 0.2172149 0.0739591 -0.0351604 -0.0000198 -0.0065962 -0.033368 -0.0000328 -0.0000094 0.0000448 0.1733778 -0.0458821 -0.0345224 -0.0701846 0.0007307 0.095548 0.0605429 -0.129785 0.019266 -0.0384219 -0.0458041 -0.0350223 0.0700068 -0.0006395 0.0956347 -0.0598555 0.1301676 -0.0184924 -0.0397909 0.1114298 0.0717247 0.0004197 -0.013224 -0.0121228 -0.0004636 0.0002795 -0.0004004 0.1334668 0.0634163 0.0284265 0.0000164 0.1068391 0.2079578 -0.0000201 0.000061 0.0000504 0.3281054 -0.0095419 -0.026126 -0.0161577 0.0914601 0.0746427 0.0917219 -0.0803549 0.0605566 -0.0490115 -0.009752 -0.0262139 0.0162309 0.0913934 0.0748123 -0.0916308 0.0805453 -0.0604281 -0.0493331 0.0074577 -0.0567973 -0.0000139 -0.154932 -0.1207248 -0.0001639 -0.0000622 -0.0001716 0.1261008 unknown
polarizability: 165.3159798|-4.021088|148.785738|-0.0195431|0.0044014|56.1409072 unknown
InChI: InChI=1S/C7H8ClN5/c1-9-5-4-3-10-13(2)6(4)12-7(8)11-5/h3,9H,1-2H3
charge 0 multiplicity 1
21 atoms
Cl -1.521875 3.294256 0.000718
N  2.306341 -0.145287 0.000217
N  2.400072 -1.54368 0.000326
N  -2.158956 -1.689845 0.000388
N  0.538653 1.567311 0.000461
N  -1.712694 0.614661 0.000696
C  0.180129 -0.905638 0.000252
C  0.990409 0.273954 0.000249
C  -1.239707 -0.674588 0.000495
C  1.112465 -1.993954 -0.000139
C  3.507497 0.687399 -0.000265
C  -0.804589 1.621204 0.000753
C  -3.609397 -1.450184 0.000619
H  0.941586 -3.069526 -0.000293
H  4.114841 0.480908 0.896287
H  4.111267 0.485594 -0.900338
H  3.183968 1.739834 0.002968
H  -1.811762 -2.647911 0.000298
H  -3.912427 -0.871522 -0.888971
H  -3.912415 -0.872766 0.891033
H  -4.128903 -2.422322 -0.000053
