program: Gaussian 09
title: 000220766
version: EM64L-G09RevD.01
frameworkgroup: C1[X(C9H11NO2)]
method: RPBEPBE
basis: SDD
operation: Freq
keyword: #p
keyword: freq=noraman
keyword: PBEPBE/SDD
title: #p freq=noraman PBEPBE/SDD
converged: YES YES NO NO
title: Mulliken charges:
elementType: O O N C C C C C C C C C H H H H H H H H H H H
charge: -0.446359 -0.260460 -0.230743 0.357065 0.168389 -0.288498 -0.613636 0.187932 -0.370827 -0.251289 -0.214546 -0.781529 0.263882 0.250087 0.238260 0.226663 0.215201 0.229495 0.227914 0.238099 0.232209 0.264062 0.358630
chargesum: 0.00000
title: Mulliken charges with hydrogens summed into heavy atoms:
elementType: O O N C C C C C C C C C
charge: -0.087729 -0.260460 -0.230743 0.357065 0.168389 -0.024615 0.101374 0.187932 -0.155626 -0.021794 0.013367 -0.047160
polarizability: 1.46292819e+02 -3.27037358e+00 1.15391311e+02 -3.12944045e+00 -5.32139693e+00 6.64376658e+01
1716.lowfreq: -6.4226 0.0005 0.0006 0.0008 5.8958 11.7561 56.9234 83.0373 102.3431
frequency: 56.9087 83.0286 102.3356 132.0735 166.6898 193.4902 199.9965 274.9587 321.8854 345.3655 349.7706 362.1416 455.2593 462.5107 528.1743 534.7396 566.5737 590.3629 592.4369 682.6369 727.5489 746.1301 790.9180 830.6868 875.2846 925.5702 967.0236 989.1504 1029.6021 1037.0586 1069.7372 1102.5758 1122.2591 1130.0366 1155.3748 1171.2908 1235.5060 1261.0948 1298.7623 1345.4552 1379.1158 1391.1842 1432.9071 1445.7100 1446.1900 1465.0098 1479.6277 1484.7054 1499.7053 1591.6242 1607.2065 1615.9840 2988.5064 2993.2577 3074.7733 3080.9918 3110.5978 3116.0548 3131.3179 3141.8218 3162.2246 3184.5004 3581.9424
redmass: 4.8569 3.5000 4.2364 1.1110 1.3307 2.0574 4.7245 4.9887 3.2150 1.2775 4.6571 2.4406 4.0417 3.2692 5.4001 4.1027 4.3083 3.4376 4.5637 4.8968 3.9850 1.2775 5.6486 1.4639 3.9348 1.3826 1.3157 1.5746 1.6725 2.2431 2.3059 1.5522 1.9128 2.1327 1.2520 1.0571 2.5648 3.5170 1.5677 3.3130 1.2952 7.3106 1.8165 1.1978 1.2214 1.0626 1.0774 1.0512 2.7822 6.9673 7.0156 7.0004 1.0385 1.0346 1.0974 1.1022 1.0888 1.0997 1.0986 1.0886 1.0960 1.0972 1.0660
irintensity: 1.0631 6.5377 3.8553 0.7355 0.9335 2.3614 4.7384 3.8699 7.7898 110.5106 0.4596 12.5302 8.2681 6.2393 5.7539 12.0609 3.6148 3.7536 9.4081 0.9570 0.5528 94.0530 23.4842 2.6009 6.4122 0.8055 0.5348 36.1029 7.9643 11.4225 90.0830 4.0707 10.6607 111.2804 45.1853 1.3293 2.2599 87.4065 14.6094 197.6053 79.0518 7.1876 42.4504 28.5048 19.8462 16.6444 10.1787 30.9067 82.0748 161.1508 21.2984 44.3335 7.8575 52.5771 21.9557 17.8629 14.3817 21.7116 8.0515 8.7366 23.8970 4.1724 31.5331
temp: 298.150 k
press: 1.00000 atm
elementType: 8 8 7 6 6 6 6 6 6 6 6 6 1 1 1 1 1 1 1 1 1 1 1
symmnumber: 1
zpe: 479806.4 jmol-1
zpe.correction: 0.182749 hartree
zpe.thermalcorrener: 0.194640 hartree
zpe.thermalcorrenthalpy: 0.195584 hartree
zpe.thermalcorrgfe: 0.145052 hartree
zpe.sumelectzpe: -553.862678 hartree
zpe.sumelectthermal: -553.850787 hartree
zpe.sumelectthermalent: -553.849843 hartree
zpe.sumelectthermalfe: -553.900375 hartree
dipole: 1.1731 3.8000 1.8825
dipole: 4.3999
quadrupole: -57.7862 -67.6159 -73.4909
quadrupole: -1.4690 -6.3997 -6.5598
quadrupole: 8.5115 -1.3182 -7.1932 -1.4690 -6.3997 -6.5598
hfenergy: -554.045427 hartree
pointgroup: C01 [X(C9H11N1O2)]
dipole: -0.5591378 -1.4936716 0.6729973 debye
dipolederiv: -0.142317 0.2573632 0.153611 0.1762903 -1.1642458 -0.2584518 0.0917858 -0.2524583 -0.4632041 -0.6114495 0.065642 -0.0388395 -0.2792661 -0.8809363 0.3702874 0.226039 0.3179004 -0.5406794 -1.2715837 -0.2284902 0.2382672 -0.1505489 -0.5991599 0.1629586 0.2364131 0.2655256 -0.4078114 0.9189516 -0.2182555 0.0093701 -0.1939917 -0.1488731 0.0749892 0.1154857 -0.0305841 -0.0081293 -0.0297696 -0.2175381 -0.0827146 -0.2125241 1.0209207 0.3158556 -0.0180046 0.3375455 0.1675708 0.0526735 0.028971 0.0203081 0.1147561 0.0350629 0.0569333 -0.1025164 0.0313814 -0.086439 0.0567706 -0.0535089 0.0650457 -0.197926 0.4062128 -0.0621982 0.0028157 -0.0552072 0.2630334 1.4324427 0.2034846 -0.245647 0.6320191 0.9852475 -0.583536 -0.3858392 -0.5310254 0.5216497 -0.0555666 0.2466584 0.1134093 -0.0241114 -0.1830206 0.0118019 0.0397859 0.0425735 -0.1785377 -0.1728788 -0.0501775 -0.0008115 -0.0674165 0.0304265 0.0538038 -0.0320859 0.0421339 -0.1657357 0.0568814 -0.0381219 0.023146 0.0963455 0.06532 0.0789561 0.0567891 0.0676324 -0.1164967 -0.421717 0.1093512 -0.0217458 0.1304063 -0.0205736 0.0425221 -0.0890971 0.0461774 0.036357 0.0300372 -0.0654213 -0.0484265 -0.0659217 0.0606954 -0.0419755 -0.0333132 -0.0221908 0.1146309 0.0953093 0.05365 0.0064789 0.0584211 -0.0953094 -0.0215826 0.0553128 -0.1042553 -0.0126623 -0.0125366 -0.07058 0.1307886 -0.0236693 0.0600011 0.0254923 0.1032424 0.0297342 0.0407308 -0.0912249 0.0461579 -0.1570313 0.0004302 0.03292 -0.0255744 -0.1402649 0.0145737 0.0112684 0.0031849 -0.0690063 -0.0467733 -0.1009298 -0.0402755 -0.0935694 -0.0643203 -0.0836238 0.1308197 0.05491 0.051128 0.0049826 0.0699009 -0.0755496 -0.0787862 0.0131997 -0.072861 0.1426325 -0.1138973 0.0589207 -0.0202014 0.0537947 0.0817867 -0.0199066 -0.0217609 -0.0145434 0.1523398 0.0702601 -0.0120572 -0.022744 0.0583775 -0.0986333 -0.067063 0.0060377 -0.0603767 0.0987737 0.0468746 0.0194422 -0.024183 0.0272762 0.1101789 -0.01214 -0.0868117 -0.010256 -0.0998313 0.0293844 -0.0314265 0.0467544 -0.0894084 0.0442267 0.0785082 0.0936126 0.0619288 0.055795 0.0752606 -0.0861854 -0.103044 -0.0123039 0.3735779 -0.0073249 -0.0665055 -0.0197245 0.3439252 unknown
polarizability: 145.7206889|-5.399907|115.3884679|3.5255091|7.2605464|67.0126388 unknown
InChI: InChI=1S/C9H11NO2/c1-7(11)10(2)8-5-3-4-6-9(8)12/h3-6,12H,1-2H3
charge 0 multiplicity 1
23 atoms
O  -0.749305 -2.166143 -0.727908
O  1.899078 1.518147 -0.873461
N  1.156862 -0.375394 0.294236
C  -0.22763 0.011734 0.195118
C  -1.200215 -0.897943 -0.30569
C  -0.650092 1.306257 0.579532
C  1.482472 -1.649228 0.980213
C  2.157419 0.425225 -0.285847
C  -2.563549 -0.528492 -0.377559
C  -2.005738 1.687383 0.489412
C  -2.966652 0.765502 0.016083
C  3.591027 -0.092126 -0.164163
H  0.102296 2.014614 0.934602
H  1.682285 -2.464873 0.263266
H  0.623977 -1.948289 1.600276
H  2.355292 -1.515823 1.642021
H  -3.303484 -1.246178 -0.756699
H  -2.308172 2.69589 0.788626
H  -4.022315 1.049145 -0.051356
H  3.69071 -1.142835 -0.489238
H  3.956373 -0.024419 0.877989
H  4.225469 0.545385 -0.79703
H  -1.497306 -2.682438 -1.118219
