program: Gaussian 09
title: 000220765
version: EM64L-G09RevD.01
frameworkgroup: C1[X(C12H10ClN5)]
method: RPBEPBE
basis: SDD
operation: Freq
keyword: #p
keyword: freq=noraman
keyword: PBEPBE/SDD
title: #p freq=noraman PBEPBE/SDD
converged: YES YES NO NO
title: Mulliken charges:
elementType: Cl N N N N N C C C C C C C C C C C C H H H H H H H H H H
charge: -0.066365 -0.138801 -0.440301 -0.092951 -0.024135 -0.094272 -0.120006 0.135741 0.188702 -0.236885 0.476219 -0.603808 -0.448160 -0.320206 -0.367035 -0.184926 -0.206769 -0.119204 0.269844 0.340179 0.259309 0.226712 0.259087 0.231811 0.323066 0.246350 0.254065 0.252739
chargesum: 0.00000
title: Mulliken charges with hydrogens summed into heavy atoms:
elementType: Cl N N N N N C C C C C C C C C C C C
charge: -0.066365 -0.138801 -0.100122 -0.092951 -0.024135 -0.094272 -0.120006 0.135741 0.188702 0.032959 0.476219 0.141299 -0.216349 0.002860 -0.120685 0.069140 0.045970 -0.119204
polarizability: 3.41551383e+02 2.24579494e+00 1.71682501e+02 -9.79174096e-03 -2.41942491e-02 7.00501802e+01
1716.lowfreq: -39.1455 -6.2588 -3.3487 -0.0012 -0.0011 -0.0009 4.8958 30.9522 51.6820
frequency: -39.1166 30.9505 51.6724 71.6254 90.9360 153.9247 162.5869 190.3832 218.6580 250.7831 259.3199 300.3462 322.9366 336.4733 408.3621 413.9407 505.8603 512.2944 520.8412 553.9601 612.9112 626.7696 636.0153 647.2555 670.2045 705.0427 716.5450 716.7055 768.7430 792.6009 809.2701 816.6749 818.8669 847.8060 862.4127 926.9926 939.2523 990.0296 992.0619 999.8751 1036.9601 1072.6552 1104.3927 1120.0194 1125.3818 1184.1481 1188.3004 1216.1380 1248.3928 1294.6141 1298.1057 1304.8011 1314.9114 1355.8037 1367.8384 1386.6332 1402.7245 1418.6289 1449.2562 1460.5289 1465.0791 1481.6277 1489.6111 1515.9463 1548.4685 1581.8927 1608.2051 1616.5532 3007.0766 3100.3868 3120.4575 3123.1237 3161.8861 3166.7214 3170.8479 3186.4121 3230.6889 3492.4937
redmass: 1.0284 6.8551 4.2477 6.8151 5.6945 5.4318 8.0038 6.0848 6.9836 3.9583 4.9951 7.2321 5.0331 5.5090 9.5444 3.0503 2.7933 5.7295 7.0442 3.4092 7.0470 7.2785 4.9229 3.8698 6.7148 3.4201 1.4336 7.2982 8.5781 3.5713 5.9348 1.4063 1.9015 1.3868 8.1031 1.4351 1.3584 1.3044 4.9947 4.6994 1.8746 2.5606 2.4612 1.8753 1.3211 1.2530 2.5749 1.8434 2.8518 1.4581 4.2780 6.1286 3.6212 4.5250 2.5545 2.5394 3.9079 1.8038 2.7470 1.0395 2.0329 2.2851 1.1062 3.8891 6.4715 8.7515 6.0807 3.1204 1.0332 1.1025 1.1023 1.0902 1.0908 1.0921 1.0953 1.0961 1.0986 1.0759
irintensity: 0.0421 0.5925 0.0094 0.4897 3.8366 1.8866 4.5153 0.1316 2.0944 1.6416 0.0043 0.6138 5.4684 0.0028 21.4219 0.0070 31.8750 7.4241 7.2637 3.3438 23.5882 1.6095 11.6748 17.4059 0.8237 5.3698 37.5524 17.4989 4.0427 23.9983 25.7641 53.1634 8.6312 55.7813 1.6518 11.9302 1.2780 2.8120 9.3644 49.6149 22.6216 39.2220 3.9313 14.1081 0.6532 0.9448 2.9486 49.8115 18.2020 9.6755 56.7735 31.2726 21.6563 35.6567 45.0724 24.6204 26.3996 27.0720 63.0212 16.1739 37.6445 435.7793 26.0472 21.0361 188.4386 281.3760 54.0767 578.3655 45.9845 12.8639 9.6582 12.1951 2.8007 16.4288 2.9913 16.9195 0.0118 34.7962
temp: 298.150 k
press: 1.00000 atm
elementType: 17 7 7 7 7 7 6 6 6 6 6 6 6 6 6 6 6 6 1 1 1 1 1 1 1 1 1 1
symmnumber: 1
zpe: 542324.7 jmol-1
zpe.correction: 0.206561 hartree
zpe.thermalcorrener: 0.220661 hartree
zpe.thermalcorrenthalpy: 0.221605 hartree
zpe.thermalcorrgfe: 0.164087 hartree
zpe.sumelectzpe: -1195.854494 hartree
zpe.sumelectthermal: -1195.840394 hartree
zpe.sumelectthermalent: -1195.839449 hartree
zpe.sumelectthermalfe: -1195.896967 hartree
dipole: -5.6225 -2.1466 0.0060
dipole: 6.0183
quadrupole: -94.8651 -106.3425 -115.1114
quadrupole: 4.5569 -0.0500 -0.0283
quadrupole: 10.5745 -0.9028 -9.6717 4.5569 -0.0500 -0.0283
hfenergy: -1196.0610543 hartree
pointgroup: C01 [X(C12H10Cl1N5)]
dipole: -2.2062716 0.8573949 0.0601045 debye
polarizability: 341.5112268|-3.4421152|171.0817739|0.4705386|8.0339185|70.6910636 unknown
InChI: InChI=1S/C12H10ClN5/c1-18-7-16-10-11(14-6-15-12(10)18)17-9-4-2-8(13)3-5-9/h2-7,17H,1H3
charge 0 multiplicity 1
28 atoms
Cl 6.467282 -0.272804 -0.011253
N  -4.150654 0.409224 0.016428
N  0.48901 0.701255 0.057773
N  -2.324925 1.802817 0.136729
N  -2.968077 -1.775932 -0.154706
N  -0.518991 -1.493071 -0.122805
C  -1.910886 0.464434 0.031056
C  -3.022322 -0.415468 -0.04458
C  -0.612502 -0.128232 -0.012355
C  -3.670756 1.723208 0.124264
C  1.8751 0.409923 0.037045
C  -5.546785 -0.041952 -0.027924
C  2.770704 1.512331 0.124323
C  2.398546 -0.908321 -0.06512
C  -1.679533 -2.22455 -0.186229
C  4.164336 1.310873 0.110038
C  3.794822 -1.109024 -0.079159
C  4.661018 -0.003384 0.007803
H  -4.344576 2.57519 0.189636
H  0.236442 1.692504 0.136252
H  -5.752855 -0.728279 0.810074
H  -6.212733 0.832515 0.044788
H  -5.7462 -0.575033 -0.972329
H  2.379683 2.534345 0.203701
H  1.705987 -1.749062 -0.131741
H  -1.547698 -3.306895 -0.27348
H  4.848905 2.161123 0.177157
H  4.199057 -2.122633 -0.157389
