program: Gaussian 09
title: 000220753
version: EM64L-G09RevD.01
frameworkgroup: C1[X(C12H11N5)]
method: RPBEPBE
basis: SDD
operation: Freq
keyword: #pfreq=noraman
keyword: PBEPBE/SDD
title: #p freq=noraman PBEPBE/SDD
converged: NO YES NO NO
title: Mulliken charges:
elementType: N N N N N C C C C C C C C C C C C H H H H H H H H H H H
charge: -0.259875 -0.006785 -0.067630 -0.082028 -0.615950 0.141259 0.406079 0.034030 -0.415873 -0.401309 -0.350077 0.182234 0.456356 -0.371827 -0.397589 -0.810029 -0.358343 0.261128 0.283026 0.313281 0.231027 0.230387 0.225340 0.224219 0.235782 0.247172 0.326677 0.339317
chargesum: 0.00000
title: Mulliken charges with hydrogens summed into heavy atoms:
elementType: N N N N N C C C C C C C C C C C C
charge: -0.259875 -0.006785 -0.067630 -0.082028 0.050044 0.141259 0.406079 0.034030 -0.154745 -0.118283 -0.036796 0.182234 0.456356 -0.140800 -0.167201 -0.124688 -0.111172
polarizability: 2.86709092e+02 -2.88016567e+00 1.70272926e+02 -4.87490130e-01 1.17986826e-01 6.86489954e+01
1716.lowfreq: -39.0420 -5.0063 -0.0008 0.0004 0.0004 2.6443 8.2292 43.5558 50.5539
frequency: -38.7205 43.5214 50.5460 108.9908 116.6744 175.5422 230.0092 249.1834 261.4258 284.3286 335.6247 362.4965 394.0533 413.3331 433.2008 508.4009 511.6050 549.8751 556.1451 558.8881 567.5911 634.3501 639.2866 667.7709 676.4713 692.9549 723.4285 786.8728 790.4628 829.7326 838.6925 859.4495 867.6679 936.0483 946.9933 971.5969 977.0639 986.0774 998.2848 1010.3762 1039.4156 1047.1674 1092.1967 1130.1138 1185.6644 1194.9744 1222.7642 1230.4795 1270.6630 1311.3139 1319.6833 1330.1135 1355.5228 1375.4044 1395.8261 1401.1307 1420.1932 1428.6276 1444.4414 1472.5535 1473.5805 1511.8739 1525.7186 1584.4378 1590.2744 1624.7879 1628.4812 2974.8218 3056.0927 3085.6670 3125.8620 3129.0681 3163.3989 3170.5979 3185.5586 3211.0906 3544.2912 3702.7334
redmass: 1.0193 4.4133 4.5046 4.9390 4.1450 5.6152 6.2149 3.9445 5.3247 5.5172 3.3133 4.5015 3.7799 3.0037 1.1583 7.3370 2.8433 1.1939 4.5044 3.5546 6.0828 6.8686 4.9349 6.9673 10.5324 8.3684 3.2833 3.1061 5.0964 1.8331 1.4175 1.2502 7.9081 1.4403 4.1666 2.6023 1.3290 1.4801 1.3258 3.1938 4.5638 1.5615 4.5977 1.2827 1.6460 1.1752 2.7250 3.3844 3.6274 2.8879 1.8812 3.3958 2.8805 6.0669 1.3370 4.3888 2.5870 3.2454 3.4813 1.0770 1.1012 2.9301 6.4403 2.7121 6.8722 3.1446 2.7125 1.0387 1.0947 1.0998 1.0904 1.0906 1.0922 1.0955 1.0940 1.0973 1.0454 1.1042
irintensity: 0.5865 0.3027 4.1530 3.0926 0.4503 1.9511 0.0269 2.7613 1.3750 0.7171 2.2444 6.7144 1.1895 0.0408 174.2459 1.2639 5.6058 125.3067 5.3345 2.2602 2.7244 1.4013 0.7876 8.3975 12.7574 10.9093 1.1717 30.2564 0.9036 14.4112 59.6377 4.2415 18.5059 11.2407 47.8569 11.3427 7.1787 1.5417 2.3451 0.2007 14.5890 20.4555 10.0027 14.8805 10.3165 15.3209 0.2278 17.1036 2.7784 48.2903 42.7156 120.1804 50.0035 6.4034 1.0570 103.3475 10.9270 7.6289 20.3445 15.2103 19.7669 254.3155 86.7021 109.0447 2.9284 263.5560 311.8113 45.8394 24.1090 17.7073 25.8107 17.3973 16.9203 15.1356 1.1850 2.2055 132.7802 36.8739
temp: 298.150 k
press: 1.00000 atm
elementType: 7 7 7 7 7 6 6 6 6 6 6 6 6 6 6 6 6 1 1 1 1 1 1 1 1 1 1 1
symmnumber: 1
zpe: 565245.1 jmol-1
zpe.correction: 0.215290 hartree
zpe.thermalcorrener: 0.228290 hartree
zpe.thermalcorrenthalpy: 0.229234 hartree
zpe.thermalcorrgfe: 0.175306 hartree
zpe.sumelectzpe: -736.457794 hartree
zpe.sumelectthermal: -736.444794 hartree
zpe.sumelectthermalent: -736.443850 hartree
zpe.sumelectthermalfe: -736.497778 hartree
dipole: 1.9327 -1.9469 0.0796
dipole: 2.7445
quadrupole: -68.3594 -94.1866 -103.9018
quadrupole: -13.3264 -0.2043 0.0515
quadrupole: 20.4565 -5.3707 -15.0858 -13.3264 -0.2043 0.0515
hfenergy: -736.6730844 hartree
pointgroup: C01 [X(C12H11N5)]
dipole: 0.7527764 0.7675531 -0.100458 debye
polarizability: 286.5854957|4.4078613|169.3146399|2.9496899|-10.1833796|69.7308777 unknown
InChI: InChI=1S/C12H11N5/c1-8-2-4-9(5-3-8)17-12-10(6-16-17)11(13)14-7-15-12/h2-7H,13H2,1H3
charge 0 multiplicity 1
28 atoms
N  0.10329 0.60574 -0.052658
N  0.500637 1.953504 -0.190394
N  1.247848 -1.590089 0.194589
N  3.696006 -1.396474 0.203642
N  4.839413 0.632501 -0.003146
C  1.216309 -0.227592 0.047877
C  -1.298323 0.293648 -0.038116
C  2.370234 0.621354 -0.028995
C  1.855426 1.949385 -0.175951
C  -2.240457 1.345392 -0.147442
C  -1.738525 -1.04707 0.087879
C  3.640519 -0.033341 0.055821
C  -4.087529 -0.28627 -0.01139
C  -3.616655 1.04688 -0.131764
C  -3.122048 -1.318054 0.101048
C  -5.573903 -0.597626 -0.026164
C  2.514351 -2.084482 0.263665
H  2.377471 2.900401 -0.271158
H  -1.883775 2.373531 -0.238919
H  -1.002837 -1.849904 0.177207
H  -4.339255 1.867798 -0.21425
H  -3.455364 -2.357995 0.202606
H  -5.802912 -1.505452 0.559047
H  -6.166089 0.236337 0.389849
H  -5.934001 -0.773025 -1.05875
H  2.60324 -3.168532 0.382454
H  4.890999 1.640967 -0.112293
H  5.692332 0.079667 0.066504
