program: Gaussian 09
title: 000220828
version: EM64L-G09RevD.01
frameworkgroup: C1[X(C21H17NO3)]
method: RPBEPBE
basis: SDD
operation: Freq
keyword: #p
keyword: freq=noraman
keyword: PBEPBE/SDD
title: #p freq=noraman PBEPBE/SDD
converged: YES YES NO NO
title: Mulliken charges:
elementType: O O O N C C C C C C C C C C C C C C C C C C C C C H H H H H H H H H H H H H H H H H
charge: -0.225607 -0.440033 -0.259998 -0.470126 -0.390936 0.567561 0.055663 0.482487 0.328195 -0.374248 -0.430260 -0.584347 -0.352230 -0.227230 -0.233881 -0.329677 -0.345025 0.300372 -0.241734 -0.210364 -0.372439 -0.252371 -0.233980 -0.222999 0.104412 0.253506 0.340346 0.254928 0.222866 0.267020 0.245624 0.228636 0.228427 0.224558 0.278389 0.231815 0.222422 0.271254 0.234754 0.237258 0.237074 0.379917
chargesum: 0.00000
title: Mulliken charges with hydrogens summed into heavy atoms:
elementType: O O O N C C C C C C C C C C C C C C C C C C C C C
charge: -0.225607 -0.060116 -0.259998 -0.129779 -0.137430 0.567561 0.055663 0.482487 0.328195 -0.119320 -0.207394 -0.317327 -0.106605 0.001406 -0.005453 -0.105120 -0.066636 0.300372 -0.009919 0.012058 -0.101185 -0.017618 0.003278 0.014075 0.104412
polarizability: 3.31132042e+02 1.96520046e+00 2.12295454e+02 -1.36315693e+01 -3.58370826e+01 2.02276666e+02
1716.lowfreq: -5.3706 -2.7350 -0.0010 -0.0002 0.0005 4.8441 18.1891 18.7253 30.3933
frequency: 18.0245 18.7157 30.3701 34.6812 52.6521 59.4737 67.6925 93.1770 125.3122 144.1106 158.6736 181.1747 190.8811 197.0205 233.7616 255.8133 292.1032 346.7763 372.1363 398.1274 404.5765 422.4849 423.5908 441.4896 472.2180 501.8224 519.6179 537.6503 574.3823 592.8533 596.1733 606.2239 613.0583 614.1733 629.7895 660.1458 682.4448 685.5176 692.8655 706.6849 723.4721 730.5235 763.1547 773.1017 800.4417 823.3360 846.5526 848.9244 856.3827 885.3531 906.5520 916.1166 927.7140 941.5612 975.9916 977.3202 979.3207 982.7198 988.1708 990.0286 992.3209 998.3890 1009.7967 1024.3389 1027.9859 1039.5159 1079.5016 1088.9458 1095.5359 1130.5170 1145.4526 1173.2938 1175.3312 1177.9623 1184.9059 1186.6842 1193.6869 1205.5871 1256.1578 1267.9088 1302.8080 1315.8829 1321.5845 1335.9022 1349.4310 1382.4807 1388.1113 1389.2845 1427.7105 1436.8689 1442.8832 1478.4915 1480.3402 1485.2903 1501.9085 1561.8720 1585.3064 1594.8678 1597.8065 1607.5966 1611.2397 1625.4849 1641.5002 2952.5857 3101.8344 3127.2413 3132.6817 3134.7690 3136.7946 3137.2906 3143.3558 3148.2394 3155.2443 3164.4204 3164.9984 3165.3131 3173.4986 3188.3279 3482.8266 3530.5225
redmass: 3.8647 6.5099 6.1012 5.4803 5.4998 7.4633 4.4872 7.9699 6.9627 5.2081 4.9123 4.5288 5.6754 5.6866 4.6126 5.0422 5.6217 7.8768 7.3264 2.7533 2.8242 3.4510 3.5056 5.9331 5.7423 4.2583 2.6520 4.5708 5.3684 2.0158 1.7897 1.4944 5.9832 5.6584 4.2973 6.3265 2.8991 2.8920 1.6330 1.6994 5.5801 3.5479 2.0843 2.4011 1.7124 4.0895 1.7965 1.9408 1.2863 1.4897 3.5251 1.5682 1.6062 1.4527 1.5233 1.3952 4.5990 3.8603 1.4402 5.4919 5.2494 1.3741 1.3502 2.3290 2.0736 2.7909 1.6398 1.5962 1.6694 2.0384 2.1164 1.1269 1.1157 1.8976 1.1459 1.1400 1.2829 1.3865 2.3079 1.7396 1.5309 1.6892 1.3865 1.3450 2.2173 4.4614 5.7458 6.2444 3.0452 2.3279 2.1514 2.1956 2.2619 2.5909 2.8565 6.2890 5.8033 6.1445 5.9008 6.0028 6.2027 6.5922 8.3379 1.0824 1.0885 1.0857 1.0854 1.0876 1.0906 1.0915 1.0884 1.0957 1.0925 1.0957 1.0945 1.1000 1.1008 1.0957 1.0761 1.0640
irintensity: 0.0539 0.4048 0.6902 0.0488 0.2481 0.5376 0.0867 0.4436 0.5493 1.3020 0.6063 0.7414 1.3741 3.2451 5.7587 1.4865 6.7452 8.6604 13.5393 0.2211 0.5472 1.1017 5.5070 2.4436 1.7114 20.5101 8.2302 15.7499 49.4179 79.3743 56.2956 130.3769 1.4010 1.1447 31.1808 1.7445 1.8602 0.7360 78.4707 74.1399 5.5478 89.3860 18.7136 26.2240 17.7572 13.7523 2.4958 1.1822 0.1978 2.3639 17.4902 28.3650 2.8525 4.2682 14.4989 0.0989 17.1109 119.6548 0.8045 0.5643 17.3995 8.6893 0.2482 10.3077 7.0748 264.2724 8.9843 4.7514 15.8624 68.8476 68.0063 6.7137 9.3395 39.2804 0.3346 6.7481 6.5651 5.1359 192.5115 31.5745 12.7692 21.4694 3.2006 14.5287 175.0825 15.4585 9.6359 1.3726 12.3149 24.9342 13.5724 11.6747 0.9517 11.9060 552.8676 91.1085 44.1877 3.3406 18.5780 7.3804 8.3238 209.6474 282.6184 47.9262 15.3728 0.1548 0.2623 17.3250 10.0692 3.6113 6.2844 23.4365 18.0096 22.3126 25.6395 16.3147 16.1565 3.7846 158.4552 43.0765
temp: 298.150 k
press: 1.00000 atm
elementType: 8 8 8 7 6 6 6 6 6 6 6 6 6 6 6 6 6 6 6 6 6 6 6 6 6 1 1 1 1 1 1 1 1 1 1 1 1 1 1 1 1 1
symmnumber: 1
zpe: 853198.1 jmol-1
zpe.correction: 0.324966 hartree
zpe.thermalcorrener: 0.346238 hartree
zpe.thermalcorrenthalpy: 0.347182 hartree
zpe.thermalcorrgfe: 0.271294 hartree
zpe.sumelectzpe: -1089.141001 hartree
zpe.sumelectthermal: -1089.119729 hartree
zpe.sumelectthermalent: -1089.118785 hartree
zpe.sumelectthermalfe: -1089.194673 hartree
dipole: 5.4033 2.5425 -2.5819
dipole: 6.5058
quadrupole: -127.1787 -144.2098 -138.6601
quadrupole: -6.2410 -1.3340 1.1188
quadrupole: 9.5042 -7.5269 -1.9772 -6.2410 -1.3340 1.1188
hfenergy: -1089.4659668 hartree
pointgroup: C01 [X(C21H17N1O3)]
dipole: -2.1270878 -0.2778773 -1.3963311 debye
polarizability: 324.861777|-25.5563725|193.2530974|23.2181448|27.5531892|227.589287 unknown
InChI: InChI=1S/C21H17NO3/c23-20(16-10-5-2-6-11-16)19(15-8-3-1-4-9-15)22-18-13-7-12-17(14-18)21(24)25/h1-14,19,22,24H
charge 0 multiplicity 1
42 atoms
O  -1.008868 1.538647 2.049528
O  6.968892 -0.341368 0.367152
O  5.840437 0.594752 2.163592
N  0.921864 0.476042 0.623349
C  -0.384629 0.414192 -0.013214
C  -0.966514 -1.016704 -0.123305
C  -1.352915 1.264974 0.85998
C  2.119792 0.057817 0.049747
C  -2.670402 1.710607 0.31741
C  -1.051684 -1.825043 1.037183
C  -1.407112 -1.537481 -1.362549
C  3.33561 0.245473 0.766053
C  2.184906 -0.54628 -1.242822
C  -1.576828 -3.132366 0.957587
C  -1.931693 -2.846769 -1.445265
C  -3.00648 1.641888 -1.061714
C  -3.614785 2.252924 1.233408
C  4.570973 -0.149314 0.206256
C  -2.021032 -3.646915 -0.283508
C  3.426872 -0.931746 -1.791262
C  4.630673 -0.741435 -1.08403
C  -4.25982 2.104503 -1.513002
C  -4.868112 2.707625 0.782854
C  -5.194714 2.634491 -0.59334
C  5.79484 0.081878 1.017506
H  -0.338848 0.848383 -1.034492
H  0.919022 0.891076 1.561077
H  -0.694882 -1.431038 1.995876
H  -1.332555 -0.926004 -2.271955
H  3.334427 0.702676 1.762587
H  1.268098 -0.735941 -1.807973
H  -1.638599 -3.751111 1.859708
H  -2.262207 -3.243266 -2.411754
H  -2.292414 1.245921 -1.789662
H  -3.337902 2.305727 2.291263
H  -2.425967 -4.663065 -0.344997
H  3.448139 -1.394754 -2.784213
H  5.594855 -1.039838 -1.501198
H  -4.508057 2.054626 -2.578441
H  -5.58991 3.119213 1.496289
H  -6.168858 2.990797 -0.946237
H  7.740288 -0.155692 0.967029
