program: Gaussian 09
title: 000220746
version: EM64L-G09RevD.01
frameworkgroup: C1[X(C10H6Cl5NO4)]
method: RPBEPBE
basis: SDD
operation: Freq
keyword: #p
keyword: freq=noraman
keyword: PBEPBE/SDD
title: #p freq=noraman PBEPBE/SDD
converged: YES YES NO NO
title: Mulliken charges:
elementType: Cl Cl Cl Cl Cl O O O O N C C C C C C C C C C H H H H H H
charge: 0.154694 0.116996 0.118066 0.004126 0.019841 -0.295860 -0.210715 -0.183080 -0.178316 0.150054 0.105238 -0.381313 -0.686514 0.231158 0.265776 -0.303278 -0.342317 -0.060773 -0.191451 -0.095379 0.339929 0.291975 0.283352 0.297743 0.280778 0.269272
chargesum: 0.00000
title: Mulliken charges with hydrogens summed into heavy atoms:
elementType: Cl Cl Cl Cl Cl O O O O N C C C C C C C C C C
charge: 0.154694 0.116996 0.118066 0.004126 0.019841 -0.295860 -0.210715 -0.183080 -0.178316 0.150054 0.445167 0.194013 -0.686514 0.231158 0.265776 -0.005535 -0.061539 -0.060773 0.077821 -0.095379
polarizability: 2.49145762e+02 -1.03693768e+01 1.18863325e+02 3.64398361e+00 -9.04758713e+00 1.82394552e+02
1716.lowfreq: 0.0016 0.0021 0.0030 2.3500 3.1602 9.5589 16.2511 22.8584 23.8631
frequency: 16.2149 22.8240 23.7580 33.0902 43.4411 67.8482 82.6354 102.3591 109.9511 155.7434 166.2221 181.1367 186.1367 206.4950 217.1981 233.6283 259.4200 274.2309 287.0044 322.9313 343.4866 353.5860 367.9622 425.7011 438.1992 485.5140 511.9205 520.8946 546.5118 553.6600 579.7697 644.7087 658.0443 680.4365 713.6969 729.4395 741.7654 750.7094 811.8749 841.3365 864.4414 874.8640 915.5152 980.8961 999.1119 1011.0100 1023.1339 1056.8682 1105.2763 1120.8805 1147.2524 1213.9019 1219.8894 1223.0365 1258.8034 1275.6708 1321.6163 1335.9877 1368.5086 1385.2277 1425.3010 1443.7521 1456.3675 1562.4799 1593.3324 1656.9400 3027.5290 3049.2158 3132.4253 3163.9100 3181.4627 3192.3941
redmass: 17.0447 15.4468 13.2069 27.3988 12.6028 11.3841 8.2922 12.0135 11.9631 6.2906 16.4776 6.8272 26.2573 9.9551 14.7661 10.0619 21.2798 12.6701 9.5875 13.7826 12.7005 4.9097 21.2895 8.5276 3.1536 4.8432 6.8681 5.9248 5.1118 6.9785 6.9595 6.2682 7.3925 6.1344 8.5766 3.8333 10.7753 9.8128 4.9977 1.3901 7.4388 4.4759 1.4882 1.3593 7.8429 3.1956 4.5262 6.1474 2.9392 2.4700 1.3172 1.3443 2.8872 3.0848 1.5822 1.3432 1.3479 1.6409 4.2298 5.7098 1.4290 2.4404 2.7803 8.5460 6.6031 12.1038 1.0836 1.0602 1.1036 1.0890 1.0976 1.0930
irintensity: 0.3722 0.1035 0.5168 0.1848 2.8208 0.9180 2.3673 0.7227 3.4870 0.2450 0.2184 1.5817 0.1349 1.1512 2.1026 6.1970 0.1449 2.7228 0.5961 0.3051 20.1136 3.0449 7.1844 7.3982 7.8774 1.2224 22.2937 2.4900 4.4533 23.9660 74.4428 30.9673 11.3818 10.0101 57.1364 21.2828 104.7859 33.2918 42.0182 24.2518 36.8488 8.6462 15.9619 0.9786 338.7618 20.3744 282.5124 44.7089 9.5746 25.4067 0.8014 12.8293 226.3616 184.1219 32.3124 12.2904 67.7239 34.4784 9.7058 20.2369 88.7839 62.2372 42.0435 29.6281 72.9916 196.4156 35.8816 4.4804 0.9940 0.2018 0.8665 2.5865
temp: 298.150 k
press: 1.00000 atm
elementType: 17 17 17 17 17 8 8 8 8 7 6 6 6 6 6 6 6 6 6 6 1 1 1 1 1 1
symmnumber: 1
zpe: 390452.1 jmol-1
zpe.correction: 0.148715 hartree
zpe.thermalcorrener: 0.169064 hartree
zpe.thermalcorrenthalpy: 0.170009 hartree
zpe.thermalcorrgfe: 0.094594 hartree
zpe.sumelectzpe: -3039.047906 hartree
zpe.sumelectthermal: -3039.027557 hartree
zpe.sumelectthermalent: -3039.026613 hartree
zpe.sumelectthermalfe: -3039.102028 hartree
dipole: -0.4164 -1.6135 -0.1177
dipole: 1.6705
quadrupole: -143.6634 -165.4444 -149.0489
quadrupole: 2.7451 -10.8276 -1.0568
quadrupole: 9.0555 -12.7255 3.6700 2.7451 -10.8276 -1.0568
hfenergy: -3039.1966216 hartree
pointgroup: C01 [X(C10H6Cl5N1O4)]
dipole: -0.0737636 -0.4979532 -0.4225751 debye
dipolederiv: -0.2876174 0.0232312 0.2609924 -0.0038815 -0.1310871 -0.0667246 0.2770345 -0.0497453 -0.5640453 -0.1593049 0.0713708 -0.0503463 0.0198637 -0.5355381 0.2362136 -0.0524638 0.2309155 -0.3505761 -0.8714177 0.0803811 -0.085293 0.0262648 -0.1818921 -0.0146199 -0.1360314 -0.0248662 -0.1684271 -0.121499 0.1126527 -0.1062437 0.1852811 -0.3609311 0.3043266 -0.1685067 0.29605 -0.290617 -0.862081 0.0239163 -0.1262109 0.0398378 -0.0331397 0.0200741 -0.1407851 0.0184753 -0.047975 -1.7980207 -0.4183589 0.1490951 -0.7076812 -0.5529745 0.0827642 0.4611642 0.1534566 -0.4635328 -0.9362109 0.1039083 -0.1745072 0.035476 -0.5555121 0.2453999 -0.1051925 0.2967581 -0.5462885 -0.264474 -0.0562113 0.0970258 -0.1151944 -0.557996 0.1721086 0.1620437 -0.0438306 -0.6173591 -0.2205524 -0.0603917 0.0548452 0.0057125 -0.4423837 -0.1638723 0.2244839 -0.031305 -0.8186833 0.1929689 0.2024905 -0.1217842 0.1233159 0.9560712 0.0814694 -0.3769562 0.0611982 1.2291399 0.8778831 0.2534444 -0.0175275 0.0147837 -0.0000103 0.1580015 0.160131 0.2281252 0.0976654 0.060717 -0.2184924 -0.1222316 -0.0961046 -0.1088285 -0.1453168 -0.0025025 -0.0123826 0.0519037 1.2812713 -0.1646092 -0.0574473 -0.0412407 0.916311 -0.2325112 -0.0909716 -0.2238392 1.1128901 2.5484063 0.1483643 0.1530298 0.5691229 0.8086533 -0.4210402 -0.3101331 -0.5385934 0.6743035 -0.867818 0.0489157 -0.1504585 0.0231705 -0.0079885 -0.0024806 -0.1242527 -0.0020795 -0.036179 0.1219238 0.1161975 -0.0762226 -0.1340247 -0.1459785 0.0717449 0.1582422 0.0997666 -0.1108443 0.2021389 -0.0818398 0.1066021 0.1728088 -0.0283163 -0.0331138 -0.1234132 -0.0655914 -0.0569999 -0.3059046 -0.3060547 0.2235334 -0.3494772 0.5199591 -0.5109739 0.2553728 -0.5084157 0.4143384 -0.3237568 0.0890257 -0.1063402 0.1910328 -0.056972 -0.0002566 -0.1891636 -0.0120866 -0.0999332 1.2727877 0.0482555 0.1240863 -0.044313 -0.0387805 -0.0066216 0.2072643 0.006974 -0.0147494 0.0855042 -0.044359 0.0170364 0.0807123 0.1198388 0.0577623 -0.1294573 -0.0459949 0.1045841 0.126008 0.051765 -0.031643 0.0391166 0.055184 0.0037777 -0.0267716 -0.017076 0.0417558 -0.0098159 0.0193028 0.0313559 0.0415945 0.0997819 0.0004067 0.0301442 0.012668 0.1267666 0.1240977 -0.0360754 0.0272332 -0.0466866 0.0943081 0.0407554 0.0348464 0.0441341 0.1184966 0.1124794 0.0411006 -0.0408889 0.0151265 0.086592 0.0598478 -0.0131036 0.0650817 0.1012274 0.0222872 -0.0479299 0.022309 -0.0446164 0.0816296 0.0628788 0.0189778 0.0622031 0.1131387 unknown
polarizability: 248.7305177|1.2594252|148.2894193|11.7719469|-33.2542037|153.3837021 unknown
InChI: InChI=1S/C10H6Cl5NO4/c11-6-2-1-5(3-7(6)12)9(17)20-8(4-16(18)19)10(13,14)15/h1-3,8H,4H2
charge 0 multiplicity 1
26 atoms
Cl -1.697376 -1.439745 -2.623228
Cl -2.325291 -2.836893 -0.019013
Cl -4.425174 -1.110057 -1.367653
Cl 3.924804 -1.833207 1.868699
Cl 6.09474 0.184778 0.454755
O  -0.671627 -0.11302 -0.023097
O  -0.321138 1.568394 -1.62704
O  -2.187618 2.432991 0.986591
O  -2.687896 1.539481 3.026775
N  -2.519482 1.461382 1.757913
C  -2.121552 -0.028384 -0.245859
C  -2.772995 0.084258 1.136365
C  -2.59585 -1.285768 -1.014759
C  0.148052 0.768704 -0.794875
C  1.582616 0.589508 -0.459538
C  2.022434 -0.413251 0.440316
C  2.522893 1.457085 -1.073824
C  3.394176 -0.541939 0.720579
C  3.892951 1.324956 -0.787051
C  4.330253 0.325325 0.110667
H  -2.338818 0.860698 -0.870062
H  -2.364469 -0.650278 1.846028
H  -3.869291 -0.027897 1.083875
H  1.301432 -1.085301 0.910201
H  2.167315 2.225528 -1.766457
H  4.629111 1.98775 -1.249908
