program: Gaussian 09
title: 000018731
version: EM64L-G09RevD.01
frameworkgroup: C1[X(C5H6N2O2)]
method: RPBEPBE
basis: SDD
operation: Freq
keyword: #pfreq=noraman
keyword: PBEPBE/SDD
title: #p freq=noraman PBEPBE/SDD
converged: YES YES NO NO
title: Mulliken charges:
elementType: O O N N C C C C C H H H H H H
charge: -0.256507 -0.262643 -0.386507 -0.502846 0.220759 -0.333855 0.148973 -0.249137 -0.145518 0.284286 0.259691 0.264328 0.346960 0.306013 0.306003
chargesum: 0.00000
title: Mulliken charges with hydrogens summed into heavy atoms:
elementType: O O N N C C C C C
charge: -0.256507 -0.262643 -0.039547 0.109171 0.220759 -0.049569 0.148973 0.010553 0.118810
polarizability: 1.09661893e+02 -1.90749094e+00 7.47772997e+01 7.94420987e-03 5.35650329e-03 3.51450653e+01
1716.lowfreq: -10.5712 -8.5410 -4.8269 -0.0007 -0.0005 0.0005 75.7337 114.5539 141.7279
frequency: 75.7334 114.5409 141.7274 142.2537 230.8363 277.9905 390.6238 462.4726 582.4630 588.6801 609.4007 733.2888 740.4321 769.8117 822.8765 842.0807 869.6599 887.8456 901.3382 1006.1110 1034.6853 1068.6588 1132.9393 1180.0952 1216.9885 1285.2410 1285.4016 1358.3024 1445.7995 1479.1440 1578.6337 1600.7853 1678.4317 3227.2498 3246.5679 3268.0045 3390.9466 3506.6732 3551.4316
redmass: 5.5376 3.9714 4.4912 1.1868 3.7942 4.9918 5.6869 7.9909 2.9061 2.8391 1.4855 3.7516 1.3761 1.6071 8.0881 1.3365 6.4587 4.6062 1.3911 1.5463 3.0325 4.0344 1.5834 3.7917 1.7626 1.2278 2.3520 2.5509 2.0022 3.6236 7.8436 7.2021 1.0614 1.0914 1.0993 1.1093 1.0426 1.0989 1.0795
irintensity: 4.5510 1.8556 2.4390 30.6772 3.7200 29.1957 2.9128 2.1418 98.2297 0.0135 95.0999 2.8247 93.9064 118.0118 48.4116 23.4295 5.1232 3.0775 2.3138 39.2401 0.2707 17.9328 14.1021 7.1927 4.0465 7.6951 68.0917 0.0575 131.6592 72.4761 69.3966 170.4484 28.8778 1.7639 0.9858 0.2078 0.2847 1.8382 42.2884
temp: 298.150 k
press: 1.00000 atm
elementType: 8 8 7 7 6 6 6 6 6 1 1 1 1 1 1
symmnumber: 1
zpe: 291447.1 jmol-1
zpe.correction: 0.111006 hartree
zpe.thermalcorrener: 0.119468 hartree
zpe.thermalcorrenthalpy: 0.120413 hartree
zpe.thermalcorrgfe: 0.077337 hartree
zpe.sumelectzpe: -453.370803 hartree
zpe.sumelectthermal: -453.362340 hartree
zpe.sumelectthermalent: -453.361396 hartree
zpe.sumelectthermalfe: -453.404472 hartree
dipole: 2.3031 -1.6389 0.0062
dipole: 2.8267
quadrupole: -41.8252 -54.7377 -52.7405
quadrupole: 0.1571 -0.0099 0.0132
quadrupole: 7.9426 -4.9699 -2.9727 0.1571 -0.0099 0.0132
hfenergy: -453.4818089 hartree
pointgroup: C01 [X(C5H6N2O2)]
dipole: -0.944627 0.5869355 0.0025454 debye
dipolederiv: -0.4066666 -0.2058133 -0.0002807 -0.1781998 -0.5766619 0.0003483 -0.0008624 0.0000111 -0.1250482 -0.7672942 0.2618019 0.0004367 0.1236382 -0.8991272 -0.0013521 -0.000172 -0.0014992 -0.3701023 -0.3105826 -0.221186 -0.0007634 -0.5809909 -0.6494696 -0.001624 -0.0020324 -0.0019648 -0.4681915 -0.1455688 -0.0958095 -0.0001435 -0.1993044 -0.4308739 -0.000151 0.0003915 -0.0002113 -0.0361018 -0.5847969 0.0598171 -0.0000171 -0.0980424 0.29765 -0.0006413 0.0002483 -0.0002853 -0.0123365 0.1526364 -0.1140733 0.0001675 -0.0228884 -0.0017614 -0.0000367 0.0004392 -0.0000159 -0.1436732 1.5191058 0.0518454 0.000882 0.2632489 1.3168103 0.0035218 0.0011839 0.003182 0.2631327 -0.0288455 0.0452565 0.0000344 0.1566039 -0.1583416 0.0000721 -0.0001238 0.0001251 -0.2059369 0.0417299 0.1724808 0.0001441 0.11362 0.257758 -0.000187 0.0002866 -0.0004606 -0.1162566 0.1309617 0.0384928 -0.0000307 0.0312165 0.0398906 0.0000961 -0.0001777 -0.0000306 0.1968532 -0.0227851 -0.0417687 -0.0000836 -0.0474368 0.118369 0.0000306 -0.0001007 0.000068 0.2013565 0.0655137 0.0275218 -0.0000814 0.0434329 0.0387554 0.0001051 -0.0001986 0.0002457 0.2208047 0.1118881 0.0194242 -0.0000555 0.0811987 0.2114734 -0.0001486 0.0008082 0.000569 0.3649414 0.122245 0.0008654 -0.0154013 0.1564908 0.2176007 -0.15329 -0.0299553 -0.0926832 0.1152445 0.122459 0.0011449 0.0151924 0.1574128 0.2179281 0.1532566 0.0302653 0.0929501 0.1153139 unknown
polarizability: 109.7636047|0.2821823|74.6755519|0.0294716|0.032427|35.1451018 unknown
InChI: InChI=1S/C5H6N2O2/c6-7-5(8)4-2-1-3-9-4/h1-3,7H,6H2
charge 0 multiplicity 1
15 atoms
O  -0.954392 1.188074 -0.000044
O  1.6841 -1.357362 -0.001996
N  1.785877 0.979456 0.004408
N  3.202684 1.045567 0.003715
C  -0.376371 -0.109958 0.000299
C  -1.385465 -1.061789 0.000999
C  1.096575 -0.230071 0.001149
C  -2.643735 -0.35172 -0.000233
C  -2.346112 1.00216 -0.000191
H  -1.226873 -2.13754 0.001557
H  -3.639909 -0.788998 -0.000562
H  -2.943332 1.909869 -0.000871
H  1.288453 1.871675 0.004939
H  3.583129 0.596246 -0.841751
H  3.58387 0.595991 0.848684
