program: Gaussian 09
title: 000220733
version: EM64L-G09RevD.01
frameworkgroup: C1[X(C10H8IN)]
method: RPBEPBE
basis: SDD
operation: Freq
keyword: #p
keyword: freq=noraman
keyword: PBEPBE/SDD
title: #p freq=noraman PBEPBE/SDD
converged: NO NO NO NO
title: Mulliken charges:
elementType: I N C C C C C C C C C C H H H H H H H H
charge: 0.080919 0.035739 0.266523 0.378741 -0.053236 -0.370689 -0.232050 -0.316591 -0.807676 -0.250542 -0.218551 -0.465332 0.242634 0.255418 0.268419 0.240311 0.238270 0.240312 0.231012 0.236367
chargesum: 0.00000
title: Mulliken charges with hydrogens summed into heavy atoms:
elementType: I N C C C C C C C C C C
charge: 0.080919 0.035739 0.266523 0.378741 -0.053236 -0.128055 0.023369 -0.048172 -0.088783 -0.019530 0.017817 -0.465332
polarizability: 2.39145293e+02 1.12906512e+01 1.39170711e+02 1.09034170e-02 6.71885775e-04 5.18705046e+01
1716.lowfreq: -5.5870 -0.0005 0.0002 0.0005 13.7633 13.7713 76.3006 143.0876 143.4391
frequency: 76.2883 143.0875 143.4389 172.7902 194.1784 205.6604 275.7495 282.0267 422.4848 475.4922 492.8012 512.3773 517.3305 561.4024 564.6743 657.9121 709.1810 773.3704 789.0658 819.8961 842.8325 877.5644 888.6440 967.5918 984.3606 998.7059 1019.5416 1046.7855 1067.0386 1086.9881 1147.5288 1173.9381 1243.5652 1266.1703 1283.5059 1344.1694 1392.5106 1404.0022 1413.5633 1453.0545 1472.0449 1473.4673 1504.1042 1547.0425 1575.3478 1619.3742 2978.4569 3055.9525 3092.7438 3131.9186 3145.1100 3160.4194 3168.5938 3175.0167
redmass: 5.8540 6.7703 3.4361 1.5983 9.8943 1.7181 3.2598 5.1211 3.1115 4.5463 5.4085 6.0294 3.4842 3.7433 7.5018 4.0712 5.1247 1.3153 3.2551 6.2987 7.2772 1.4880 1.4109 1.3623 1.8950 1.3278 2.4159 1.5696 2.8959 2.2808 1.4551 1.1370 1.7308 2.3733 3.2834 2.9928 2.6069 1.4528 3.1080 3.0061 1.0451 1.1670 3.7534 7.4169 6.1002 6.3324 1.0379 1.0971 1.0986 1.0854 1.0898 1.0962 1.0932 1.0992
irintensity: 0.9528 0.2911 2.8899 0.2126 7.3617 2.0597 0.0763 0.1021 6.1633 4.2261 5.5791 3.2780 0.3549 1.9753 22.4881 0.1303 1.8761 90.1508 1.2690 49.3339 29.1433 10.6145 11.3257 2.3525 7.3211 0.2322 5.1885 7.4197 9.8713 64.7139 42.2323 2.6232 2.6431 24.3878 26.1256 35.1880 4.3252 13.3485 46.8055 5.6629 16.4989 62.0598 14.0760 174.5085 96.9900 6.2581 18.4838 13.7001 17.0634 0.4082 10.7768 24.8262 5.3546 16.8574
temp: 298.150 k
press: 1.00000 atm
elementType: 53 7 6 6 6 6 6 6 6 6 6 6 1 1 1 1 1 1 1 1
symmnumber: 1
zpe: 393516.7 jmol-1
zpe.correction: 0.149883 hartree
zpe.thermalcorrener: 0.160020 hartree
zpe.thermalcorrenthalpy: 0.160964 hartree
zpe.thermalcorrgfe: 0.112639 hartree
zpe.sumelectzpe: -451.300231 hartree
zpe.sumelectthermal: -451.290094 hartree
zpe.sumelectthermalent: -451.289150 hartree
zpe.sumelectthermalfe: -451.337475 hartree
dipole: -3.8516 2.6092 0.0000
dipole: 4.6522
quadrupole: -71.8323 -75.1608 -88.8163
quadrupole: 0.6861 -0.0001 0.0001
quadrupole: 6.7708 3.4423 -10.2132 0.6861 -0.0001 0.0001
hfenergy: -451.4501134 hartree
pointgroup: C01 [X(C10H8I1N1)]
dipole: 1.2108895 1.3725107 -0.0000137 debye
dipolederiv: -0.8665534 -0.2231639 -0.0000743 -0.3061319 -0.137322 -0.0000371 0.0000902 0.000014 -0.0476505 -1.2471724 -0.0823808 -0.0000871 0.6449178 -0.3584235 0.0001043 0.0000461 0.0001014 -0.1841598 -0.1489104 -0.0430102 0.0000002 0.1573251 -0.3231932 0.0000165 -0.0001879 -0.0000586 0.0323792 0.4159185 0.1853607 0.0000175 -0.1514491 0.4576743 -0.0000095 0.0000153 0.0000247 0.002379 0.5053184 0.0509812 -0.0000152 -0.2705365 0.079429 -0.000033 0.000005 -0.0000305 0.0765256 0.0120387 0.0416627 -0.0000102 0.0545143 0.0601633 -0.0000069 0.0001296 0.0000325 -0.1607228 -0.6336063 -0.4240135 -0.0000115 -0.3637229 -0.3028656 0.0000015 -0.0000656 -0.0000361 -0.1112246 -0.1471123 0.0396425 0.0000263 -0.0031829 0.0994168 0.0000025 -0.0000133 -0.0000109 -0.152487 -0.0031002 -0.1302947 -0.0000011 -0.0280499 -0.1721086 0.0000114 0.0001105 0.0000604 0.0446578 0.0366909 0.0983704 0.0000021 0.1520484 -0.012248 -0.0000058 -0.000113 -0.0000344 -0.1503148 -0.0025808 -0.1215479 -0.0000065 -0.1403822 0.0710121 -0.0000104 0.0001261 0.0000409 -0.1499971 2.066661 0.511158 0.0001749 0.2330989 0.4713403 -0.000039 -0.0000204 -0.0000187 -0.0530113 0.073103 -0.0183849 0. -0.0757917 -0.0902802 0.0000059 0.0000586 0.0000128 0.1481787 0.0003787 0.0843669 -0.0000122 0.076021 0.029943 -0.0000077 -0.000011 -0.0000169 0.1599256 0.1023787 -0.0497761 -0.0000026 0.0022952 -0.0376902 0.0000061 -0.0000016 0.0000065 0.1618467 0.0407687 -0.0602477 0.1064467 -0.0313281 0.0279509 0.0203075 0.0834261 0.0632266 -0.0253595 -0.0795145 0.1580448 -0.000003 0.0405562 0.0389297 -0.0000015 0.0000284 -0.0000079 0.1132506 0.0407194 -0.06027 -0.1064448 -0.0313504 0.0279336 -0.0203116 -0.0835735 -0.0632869 -0.0253573 -0.1156644 -0.0601858 0.0000034 -0.0670194 0.0664563 0.0000051 -0.0000007 -0.0000085 0.160338 -0.0497612 0.1036885 -0.0000027 0.1081684 0.0038822 0.0000017 -0.0000493 -0.0000105 0.1608034 unknown
polarizability: 238.3690396|14.2997136|139.9469639|0.0107256|0.002073|51.8705046 unknown
InChI: InChI=1S/C10H8IN/c1-7-6-10(11)12-9-5-3-2-4-8(7)9/h2-6H,1H3
charge 0 multiplicity 1
20 atoms
I  -4.028037 -1.305594 0.000024
N  -1.000514 -1.365283 0.000009
C  0.558655 0.568343 -0.000013
C  -0.573039 1.473257 -0.000015
C  0.296499 -0.855008 -0.000001
C  1.92202 1.010291 -0.000021
C  -1.85933 0.920763 -0.000004
C  1.382788 -1.784179 0.000001
C  -0.37662 2.973826 -0.000025
C  2.970794 0.085786 -0.000019
C  2.700796 -1.320212 -0.000008
C  -2.000798 -0.504907 0.000007
H  2.140161 2.083425 -0.000029
H  -2.747944 1.557334 -0.000005
H  1.138086 -2.850338 0.000009
H  0.190614 3.305815 -0.890188
H  -1.344551 3.501974 -0.000041
H  0.190592 3.305829 0.890147
H  4.010149 0.432344 -0.000025
H  3.535678 -2.02947 -0.000006
