program: Gaussian 09
title: 000220725
version: EM64L-G09RevD.01
frameworkgroup: C1[X(C18H14O2)]
method: RPBEPBE
basis: SDD
operation: Freq
keyword: #pfreq=noraman
keyword: PBEPBE/SDD
title: #p freq=noraman PBEPBE/SDD
converged: YES YES NO NO
title: Mulliken charges:
elementType: O O C C C C C C C C C C C C C C C C C C H H H H H H H H H H H H H H
charge: -0.198055 -0.198055 0.298138 0.298154 -0.539324 -0.539333 -0.414405 -0.414400 -0.561139 -0.561156 0.268264 0.268267 -0.226917 -0.226918 0.274760 0.274760 -0.377122 -0.377122 -0.228644 -0.228643 0.227901 0.234946 0.227897 0.234948 0.214087 0.208334 0.214086 0.208334 0.289280 0.289281 0.290480 0.290480 0.239417 0.239417
chargesum: 0.00000
title: Mulliken charges with hydrogens summed into heavy atoms:
elementType: O O C C C C C C C C C C C C C C C C C C
charge: -0.198055 -0.198055 0.298138 0.298154 -0.076478 -0.076488 0.008016 0.008020 -0.271859 -0.271875 0.268264 0.268267 -0.226917 -0.226918 0.274760 0.274760 -0.086642 -0.086642 0.010774 0.010774
polarizability: 3.30750353e+02 -3.14369607e-04 2.12176390e+02 6.87234279e-03 1.17501415e+00 9.09294302e+01
1716.lowfreq: -14.3921 -11.2090 -0.0005 0.0003 0.0006 3.2591 37.6374 63.8051 74.4845
frequency: 37.5587 63.7480 74.4450 123.0790 138.6919 140.5633 195.7441 195.9094 259.3622 266.1859 311.7296 323.5357 333.3562 371.3617 414.6381 425.2977 439.7218 440.5619 453.6356 477.8483 484.7732 562.3693 602.8763 620.0648 647.9591 669.8343 676.9707 717.1178 721.8114 727.1534 727.7669 806.9993 822.5691 843.2376 866.6694 867.4664 887.8625 930.4113 944.5812 949.8327 963.9029 968.6267 970.3422 999.3219 1015.6519 1033.7052 1070.3816 1083.5620 1091.7650 1100.7377 1134.2361 1159.5963 1165.9141 1172.9158 1181.6863 1215.4556 1221.2141 1234.0176 1247.2567 1271.1870 1281.2797 1308.8658 1319.4635 1335.6856 1344.7675 1356.7736 1389.4897 1402.6650 1412.3649 1441.6178 1447.9864 1451.2103 1468.6578 1473.0477 1476.5480 1487.8275 1534.0423 1542.9839 1561.9503 1597.6224 1601.4637 1622.6752 2960.7674 2961.2619 2981.8534 2984.2034 3025.4797 3027.2668 3046.6376 3053.2696 3133.3119 3135.7054 3136.2732 3150.4228 3161.1777 3170.8604
redmass: 5.5706 3.3278 3.4495 4.7748 4.4127 4.7548 4.5851 3.7315 5.6472 4.4402 1.8653 4.3140 5.5735 10.8432 2.8403 4.4506 4.6121 3.0637 7.7450 5.0380 3.4675 5.0616 6.1433 2.8560 5.6813 3.9134 5.3961 5.2525 4.3181 2.4425 4.4015 1.7483 1.5859 4.7241 2.4193 2.3806 1.5118 1.4939 2.6424 4.7456 1.4202 1.9399 2.7153 1.3983 1.3747 1.9760 3.7810 1.9048 1.7695 2.0319 1.1662 1.6804 1.3222 1.1348 4.5040 2.0534 2.8353 1.3459 1.2798 1.2602 1.7154 3.2538 1.6621 1.6490 1.4015 1.8634 7.1125 7.1301 4.8631 2.7481 1.1629 1.0840 2.6767 1.0883 1.0916 3.2793 8.8885 9.9068 7.4444 8.6686 6.3664 7.6681 1.0650 1.0652 1.0662 1.0607 1.0934 1.0948 1.0977 1.1039 1.0910 1.0862 1.0916 1.0900 1.0946 1.1004
irintensity: 4.2788 0.0011 3.0565 0.0001 1.3382 0.4552 0.5443 0.0161 0.3497 2.3546 0.0271 3.1757 0.4549 23.2722 7.2974 1.2817 0.1689 0.4445 0.5250 0.3258 0.0258 1.2617 11.2362 0.0266 2.1311 0.0773 0.0002 5.6446 2.0837 71.1041 1.2250 27.2188 10.3525 0.0528 0.0095 0.1924 2.4444 0.1113 2.1262 64.1314 28.3902 0.3215 5.6287 6.6216 0.0004 1.2543 0.2805 1.1486 0.0219 8.5887 1.8530 0.2221 0.9664 15.3326 0.0496 1.7605 35.8560 0.6216 6.9911 5.2110 0.5895 640.0097 0.7186 101.7049 2.1292 44.0796 3.8705 5.9120 3.0573 0.0392 0.0723 26.5088 13.8471 11.5638 11.2722 0.1391 0.5102 313.0747 24.8053 5.0816 0.8188 0.0680 30.7842 0.0676 40.1552 31.9178 49.1641 2.1512 74.8978 55.8703 0.9598 3.9088 5.9636 5.8665 1.8469 33.8419
temp: 298.150 k
press: 1.00000 atm
elementType: 8 8 6 6 6 6 6 6 6 6 6 6 6 6 6 6 6 6 6 6 1 1 1 1 1 1 1 1 1 1 1 1 1 1
symmnumber: 1
zpe: 703728.7 jmol-1
zpe.correction: 0.268036 hartree
zpe.thermalcorrener: 0.283255 hartree
zpe.thermalcorrenthalpy: 0.284199 hartree
zpe.thermalcorrgfe: 0.225511 hartree
zpe.sumelectzpe: -843.427548 hartree
zpe.sumelectthermal: -843.412330 hartree
zpe.sumelectthermalent: -843.411385 hartree
zpe.sumelectthermalfe: -843.470073 hartree
dipole: -1.8111 0.0000 0.0004
dipole: 1.8111
quadrupole: -81.9031 -126.2548 -117.6646
quadrupole: -0.0001 0.0019 0.1254
quadrupole: 26.7044 -17.6473 -9.0571 -0.0001 0.0019 0.1254
hfenergy: -843.6955843 hartree
pointgroup: C01 [X(C18H14O2)]
dipole: -0.7125251 -0.0000096 -0.0001843 debye
polarizability: 330.750353|-0.0002545|212.182615|-0.0000682|0.7911086|90.923205 unknown
InChI: InChI=1S/C18H14O2/c19-17-13-7-3-4-8-14(13)18(20)16-10-12-6-2-1-5-11(12)9-15(16)17/h3-4,7-10H,1-2,5-6H2
charge 0 multiplicity 1
34 atoms
O  1.143267 -2.76334 -0.016849
O  1.143293 2.763258 0.018476
C  -2.60477 -0.714972 -0.009049
C  -2.604763 0.714928 0.010256
C  -3.906192 -1.509414 -0.047791
C  -3.906188 1.509376 0.04868
C  -5.142148 -0.680641 0.365338
C  -5.142017 0.680631 -0.36488
C  -1.368619 -1.400805 -0.013261
C  -1.368607 1.400747 0.014755
C  -0.134839 -0.713791 -0.004915
C  -0.134832 0.71372 0.006689
C  1.139831 -1.489902 -0.008482
C  1.139845 1.489817 0.010562
C  2.420154 -0.713203 -0.003641
C  2.420161 0.713109 0.005279
C  3.651134 -1.414447 -0.008041
C  3.651148 1.414344 0.009275
C  4.871112 -0.70924 -0.003834
C  4.871118 0.709126 0.004662
H  -4.055104 -1.885585 -1.081867
H  -3.807651 -2.408423 0.589965
H  -4.055414 1.885456 1.082745
H  -3.807456 2.408439 -0.588969
H  -6.063633 -1.247178 0.13556
H  -5.13229 -0.507957 1.460238
H  -6.063572 1.247176 -0.135407
H  -5.131788 0.507957 -1.459778
H  -1.341033 -2.496761 -0.022732
H  -1.341011 2.496702 0.024246
H  3.620725 -2.508611 -0.014619
H  3.620749 2.508508 0.015882
H  5.82009 -1.256047 -0.007171
H  5.820102 1.255927 0.007681
