program: Gaussian 09
title: 000220720
version: EM64L-G09RevD.01
frameworkgroup: C1[X(C13H10N4O4)]
method: RPBEPBE
basis: SDD
operation: Freq
keyword: #p
keyword: freq=noraman
keyword: PBEPBE/SDD
title: #p freq=noraman PBEPBE/SDD
converged: NO YES NO NO
title: Mulliken charges:
elementType: O O O O N N N N C C C C C C C C C C C C C H H H H H H H H H H
charge: -0.185724 -0.265969 -0.210760 -0.205214 -0.416202 0.025280 0.015975 -0.007379 0.312340 0.262859 0.447821 -0.497628 -0.289185 -0.368251 0.442677 -0.366005 -0.368480 -0.357095 -0.220700 -0.216214 -0.225737 0.336728 0.292388 0.293383 0.350010 0.221887 0.230225 0.260697 0.236058 0.234868 0.237351
chargesum: 0.00000
title: Mulliken charges with hydrogens summed into heavy atoms:
elementType: O O O O N N N N C C C C C C C C C C C C C
charge: -0.185724 -0.265969 -0.210760 -0.205214 -0.066192 0.025280 0.015975 -0.007379 0.312340 0.262859 0.447821 -0.160900 0.003202 -0.074868 0.442677 -0.144119 -0.138256 -0.096398 0.015358 0.018654 0.011614
polarizability: 4.96036024e+02 -6.48309871e-02 2.32919994e+02 2.67077358e-02 -1.25575082e-02 6.75054714e+01
1716.lowfreq: -9.4133 -0.0005 0.0002 0.0006 2.5573 4.2803 23.8408 34.4974 42.1475
frequency: 23.6700 34.4957 42.1473 58.9160 73.8742 86.3351 139.7778 157.4760 157.7834 164.8602 210.2111 254.0035 291.1729 305.2846 347.8593 353.1390 366.5286 402.8693 410.1962 443.3477 473.2322 508.9034 513.6174 517.2076 603.2855 614.1552 636.9388 651.0373 665.5474 677.0727 695.2390 706.3439 724.0563 754.9998 772.7248 801.9185 841.5719 853.7545 862.4202 872.9835 904.0975 925.7569 961.5993 964.7373 986.8640 988.2118 1005.1984 1010.5777 1023.5179 1041.7492 1063.4575 1089.5629 1102.0198 1138.5585 1168.1346 1175.7363 1185.8989 1212.3492 1231.4194 1243.6001 1299.7618 1310.5005 1331.3712 1346.9460 1363.5406 1389.2683 1406.4373 1438.3694 1448.9549 1479.1491 1483.8631 1517.3685 1555.8310 1581.7402 1594.2500 1612.3211 1623.6893 2999.1768 3124.3040 3136.3487 3149.4643 3162.9317 3173.7149 3180.3948 3189.2949 3196.8659 3200.5195
redmass: 3.9748 7.2352 6.8760 13.6824 10.2918 6.2312 6.5951 11.7659 5.8719 6.3529 7.5933 2.8678 6.8225 9.0993 5.2143 8.2978 11.7901 2.8143 7.2953 4.1058 8.3569 3.3628 7.6905 3.4482 6.7624 6.4890 6.8068 7.8262 6.1208 10.3693 1.7472 7.6687 5.0797 12.7390 1.7235 5.7072 1.1777 1.2563 1.3867 5.8638 5.0352 1.3691 1.5775 1.4058 1.3890 6.2633 1.3392 1.3182 2.1861 3.1158 2.5672 1.6938 4.0830 1.3490 8.3897 1.0631 1.1155 4.6548 1.8848 2.1145 2.0129 1.8710 1.6673 4.0762 6.6801 7.3600 3.2197 2.3763 5.6703 2.8502 2.5393 3.6893 5.9720 5.2694 4.9103 6.0437 7.1525 1.0878 1.0881 1.0869 1.0917 1.0960 1.1010 1.0894 1.0919 1.0796 1.0963
irintensity: 0.2099 1.0003 0.3691 0.1143 0.7932 0.9153 2.0488 2.3030 0.0651 5.8900 3.6435 17.2495 0.0013 2.0050 2.3717 3.9250 5.0489 0.0891 25.0182 1.8952 0.2562 20.2729 6.1352 2.2545 3.3224 0.2707 12.6883 15.5270 0.2841 13.7020 49.2159 9.4059 2.0214 8.9119 58.3849 0.4966 93.2935 0.1473 16.0509 7.2019 4.3689 2.5826 35.8332 30.8249 0.4779 0.7911 0.8258 0.0529 14.8074 10.8199 92.4519 19.3002 52.3790 58.8588 375.2106 3.8631 22.3481 547.6752 172.5584 14.2503 88.2644 47.2781 121.9592 178.6807 40.4365 8.5282 23.8148 11.7058 1.9399 58.4178 47.3091 73.7157 11.9121 92.5941 76.5712 7.5300 530.1611 28.1012 6.1845 0.1587 14.6056 25.1758 30.2773 3.2068 18.5541 73.2603 0.3781
temp: 298.150 k
press: 1.00000 atm
elementType: 8 8 8 8 7 7 7 7 6 6 6 6 6 6 6 6 6 6 6 6 6 1 1 1 1 1 1 1 1 1 1
symmnumber: 1
zpe: 572953.7 jmol-1
zpe.correction: 0.218227 hartree
zpe.thermalcorrener: 0.235656 hartree
zpe.thermalcorrenthalpy: 0.236600 hartree
zpe.thermalcorrgfe: 0.170419 hartree
zpe.sumelectzpe: -1019.627053 hartree
zpe.sumelectthermal: -1019.609623 hartree
zpe.sumelectthermalent: -1019.608679 hartree
zpe.sumelectthermalfe: -1019.674860 hartree
dipole: 9.3163 -0.7813 -0.0007
dipole: 9.3490
quadrupole: -132.8219 -130.0032 -123.0007
quadrupole: -3.8765 -0.0139 -0.0096
quadrupole: -4.2133 -1.3946 5.6079 -3.8765 -0.0139 -0.0096
hfenergy: -1019.8452792 hartree
pointgroup: C01 [X(C13H10N4O4)]
dipole: -3.6642804 0.3196667 -0.000283 debye
polarizability: 496.0326272|-0.9475795|232.9233905|-0.0266655|0.012647|67.5054714 unknown
InChI: InChI=1S/C13H10N4O4/c18-16(19)11-6-7-12(13(8-11)17(20)21)15-14-9-10-4-2-1-3-5-10/h1-9,15H
charge 0 multiplicity 1
31 atoms
O  3.282674 -3.168373 -0.000347
O  1.005593 -3.155786 0.000029
O  4.836032 2.909902 -0.000158
O  5.869622 0.871049 -0.001585
N  -0.290185 -0.896521 0.000215
N  2.164287 -2.531963 -0.001998
N  4.812739 1.615398 0.000175
N  -1.43995 -0.123341 0.000986
C  0.949056 -0.295809 0.000015
C  2.169439 -1.070267 -0.000896
C  3.4958 0.956578 0.000105
C  3.433503 -0.441096 -0.000761
C  1.069245 1.13317 0.000883
C  2.315186 1.752734 0.000906
C  -3.873133 -0.096391 0.000504
C  -2.582891 -0.787232 0.001151
C  -5.06572 -0.873808 0.00024
C  -3.972427 1.32587 0.000048
C  -6.328885 -0.247272 -0.000274
C  -5.234798 1.946178 -0.000518
C  -6.417602 1.163826 -0.000667
H  4.344902 -1.044347 -0.001411
H  0.145393 1.714233 0.001588
H  2.410876 2.841557 0.001563
H  -0.28452 -1.939745 -0.000088
H  -2.610042 -1.894427 0.000183
H  -4.998227 -1.968779 0.000512
H  -3.053152 1.919593 0.00014
H  -7.240099 -0.854472 -0.000411
H  -5.305517 3.039159 -0.000889
H  -7.397997 1.652184 -0.00114
