program: Gaussian 09
title: 000220718
version: EM64L-G09RevD.01
frameworkgroup: C1[X(C12H20O2)]
method: RPBEPBE
basis: SDD
operation: Freq
keyword: #pfreq=noraman
keyword: PBEPBE/SDD
title: #p freq=noraman PBEPBE/SDD
converged: YES YES NO NO
title: Mulliken charges:
elementType: O O C C C C C C C C C C C C H H H H H H H H H H H H H H H H H H H H
charge: -0.418323 -0.230901 -0.068879 -0.423515 -0.454255 -0.431812 -0.388459 -0.219681 -0.431149 -0.368893 -0.220113 -0.377222 -0.487682 0.170948 0.198298 0.212269 0.192028 0.195240 0.206164 0.215186 0.187888 0.209314 0.203128 0.212893 0.210393 0.211162 0.188979 0.192333 0.199283 0.218226 0.217571 0.252010 0.252580 0.374993
chargesum: 0.00000
title: Mulliken charges with hydrogens summed into heavy atoms:
elementType: O O C C C C C C C C C C C C
charge: -0.043330 -0.230901 0.129419 -0.019219 -0.052852 -0.019370 0.014615 -0.006788 -0.009594 0.012419 -0.020830 0.058575 0.016908 0.170948
polarizability: 1.69840572e+02 -1.80962743e+00 1.20500249e+02 -8.94088068e+00 -1.57566979e+00 1.06139535e+02
1716.lowfreq: -12.9077 -5.1500 -0.0010 -0.0008 -0.0007 9.1637 15.6260 25.0745 44.5605
frequency: 15.0945 24.9534 44.3379 49.9191 63.2591 99.7609 123.2879 126.3434 144.5875 182.5909 217.4719 279.6701 304.6938 392.2320 393.4442 447.3924 486.3807 499.7488 504.8327 549.0825 587.7504 638.4577 696.9465 723.8236 725.5780 747.0526 784.8186 828.5351 843.5211 857.0586 873.4087 906.2416 946.4894 961.9246 979.3833 988.1698 1012.0078 1032.0685 1047.7435 1058.5639 1080.6515 1084.7373 1086.5460 1101.3447 1110.7671 1123.5125 1140.1198 1169.0389 1215.7946 1220.8580 1234.9476 1245.3618 1253.3205 1265.6530 1278.8702 1285.5690 1289.7171 1306.8477 1315.5261 1331.4164 1333.5680 1338.0907 1350.3688 1356.1161 1370.1440 1388.2179 1436.9089 1453.3280 1458.6983 1463.5764 1468.9554 1472.3230 1475.4604 1485.3460 1668.7826 1669.6301 2937.5822 2949.7112 2950.0289 2954.4346 2962.0225 2974.6490 2980.9479 2985.3668 2991.2946 2994.7349 3005.3410 3008.6970 3027.6410 3029.0335 3038.0014 3043.9133 3060.7428 3084.2270 3116.9233 3510.6319
redmass: 8.1424 4.3099 2.7880 2.3780 3.1395 2.5975 1.9601 3.4368 2.2791 4.2433 3.1862 2.5884 2.4178 3.5998 2.9008 2.4073 3.5799 1.7905 2.7313 3.2173 4.6073 1.3102 1.5221 1.1063 1.5102 1.3611 2.3375 1.6797 1.8890 4.6070 1.7169 2.2110 1.4929 2.4421 1.3723 2.1028 3.0351 3.0317 1.8061 2.3653 2.1495 2.1557 1.7283 1.7893 1.9666 1.3859 1.0684 1.4478 1.2893 1.4061 1.2582 1.4175 1.2098 1.2451 1.3421 1.1072 1.1235 1.3164 1.5302 1.3847 1.6354 1.4473 1.5744 1.5753 1.8511 1.5683 1.0848 1.0884 1.0822 1.0660 1.0860 1.0940 1.0892 1.1000 6.6875 8.2233 1.0804 1.0592 1.0637 1.0596 1.0622 1.0612 1.0667 1.0612 1.0951 1.0604 1.0922 1.0989 1.0994 1.0994 1.1033 1.1032 1.1031 1.0835 1.0986 1.0639
irintensity: 0.8853 0.0137 0.2581 0.2056 0.0756 0.1674 0.1074 0.9839 0.4531 0.7041 0.4942 0.5311 0.9848 8.6320 3.2775 9.9116 16.5106 28.1574 3.3229 4.9982 13.1886 129.2174 22.3284 15.7541 25.7294 1.0824 3.9120 5.2608 2.9263 1.8918 8.6833 8.2777 2.4998 5.1066 6.5289 21.0541 133.4789 28.9912 12.8354 67.5559 5.0626 31.0652 0.1703 2.7221 3.2480 0.6887 1.1456 9.8836 20.9131 2.3403 1.3144 5.0522 0.2282 0.7804 11.5598 0.8629 0.6290 4.6374 15.3138 3.4079 2.9711 5.0064 10.1193 1.8987 31.8710 0.7459 27.8929 9.0034 1.1554 0.0382 9.8945 1.9661 9.4152 18.4988 2.8243 208.3657 23.0836 8.7661 41.4583 8.0731 70.8619 48.1558 26.0872 5.0217 6.3946 39.5765 39.4367 7.1811 13.2302 42.6695 62.5453 84.0024 86.1963 10.6882 53.6230 17.6913
temp: 298.150 k
press: 1.00000 atm
elementType: 8 8 6 6 6 6 6 6 6 6 6 6 6 6 1 1 1 1 1 1 1 1 1 1 1 1 1 1 1 1 1 1 1 1
symmnumber: 1
zpe: 778318.3 jmol-1
zpe.correction: 0.296446 hartree
zpe.thermalcorrener: 0.311942 hartree
zpe.thermalcorrenthalpy: 0.312887 hartree
zpe.thermalcorrgfe: 0.250177 hartree
zpe.sumelectzpe: -618.604086 hartree
zpe.sumelectthermal: -618.588589 hartree
zpe.sumelectthermalent: -618.587645 hartree
zpe.sumelectthermalfe: -618.650355 hartree
dipole: -0.6151 -1.6019 0.6385
dipole: 1.8309
quadrupole: -81.8400 -90.1716 -86.3094
quadrupole: -4.1656 1.6451 3.3256
quadrupole: 4.2670 -4.0646 -0.2024 -4.1656 1.6451 3.3256
hfenergy: -618.9005318 hartree
pointgroup: C01 [X(C12H20O2)]
dipole: 0.2451634 -0.6019714 -0.310476 debye
polarizability: 169.8101353|2.9219173|120.0971984|-8.7447707|2.8704622|106.5730233 unknown
InChI: InChI=1S/C12H20O2/c13-12(14)10-6-2-5-9-11-7-3-1-4-8-11/h3,7,11,13H,1-2,4-6,8-10H2
charge 0 multiplicity 1
34 atoms
O  -6.174212 -0.505624 -0.699045
O  -5.214043 1.208346 0.537023
C  2.591614 -0.248997 0.861552
C  1.30823 -0.818516 0.180601
C  3.835689 -1.140455 0.589227
C  4.45826 -0.854364 -0.798123
C  0.014461 -0.03318 0.492374
C  2.87004 1.193888 0.458918
C  4.943016 0.612037 -0.886784
C  -1.246921 -0.699029 -0.102525
C  3.925254 1.579528 -0.30819
C  -2.54177 0.084959 0.203229
C  -3.785331 -0.591179 -0.404082
C  -5.074579 0.152411 -0.117411
H  2.393688 -0.25922 1.9564
H  1.460061 -0.849727 -0.917108
H  1.178309 -1.869401 0.515971
H  3.555642 -2.209013 0.673549
H  4.600788 -0.94348 1.367117
H  0.097814 0.998838 0.097663
H  -0.104333 0.058862 1.592769
H  3.703377 -1.038434 -1.587667
H  5.300065 -1.546199 -0.992024
H  2.174757 1.958998 0.831789
H  5.159192 0.882379 -1.940036
H  5.906029 0.72708 -0.343892
H  -1.335938 -1.732869 0.293225
H  -1.122246 -0.796379 -1.20171
H  4.068415 2.647356 -0.528752
H  -2.457314 1.11749 -0.18673
H  -2.673445 0.182328 1.297992
H  -3.901034 -1.626211 -0.025735
H  -3.688897 -0.688344 -1.50363
H  -7.003638 0.006221 -0.494149
