program: Gaussian 09
title: 000220709
version: EM64L-G09RevD.01
frameworkgroup: C1[X(C12H16N4O5)]
method: RPBEPBE
basis: SDD
operation: Freq
keyword: #p
keyword: freq=noraman
keyword: PBEPBE/SDD
title: #p freq=noraman PBEPBE/SDD
converged: YES YES NO NO
title: Mulliken charges:
elementType: O O O O O N N N N C C C C C C C C C C C C H H H H H H H H H H H H H H H H
charge: -0.435154 -0.184993 -0.266298 -0.209903 -0.204629 -0.424329 0.026243 0.025730 0.016552 -0.356006 -0.387919 -0.383779 -0.439312 -0.326623 -0.217070 0.312151 0.264178 -0.296717 -0.497212 0.446279 -0.367686 0.203645 0.199440 0.198317 0.220165 0.184799 0.217251 0.230455 0.225198 0.183467 0.217407 0.220469 0.346280 0.298975 0.336291 0.293546 0.330790
chargesum: 0.00000
title: Mulliken charges with hydrogens summed into heavy atoms:
elementType: O O O O O N N N N C C C C C C C C C C C C
charge: -0.104364 -0.184993 -0.266298 -0.209903 -0.204629 -0.078049 0.026243 0.025730 0.016552 0.047079 0.030563 0.018271 0.016341 0.074251 0.003399 0.312151 0.264178 0.002258 -0.160921 0.446279 -0.074140
polarizability: 3.32275670e+02 4.00762992e+01 1.99659204e+02 5.43640210e+01 -2.44597786e+01 1.39381102e+02
1716.lowfreq: -2.8283 0.0002 0.0004 0.0006 4.0584 5.5787 11.1493 19.7979 47.6597
frequency: 10.4898 19.5917 47.6560 55.4294 59.0342 63.5861 72.2787 91.9383 115.7639 135.0660 142.5036 158.5329 162.3602 171.4413 227.1261 238.4622 272.0257 299.5802 317.3180 319.4691 332.5639 344.5111 373.5734 401.4708 441.4338 446.7262 499.6198 505.4322 516.0337 531.6784 617.1443 652.8307 654.2978 675.4390 706.7943 726.6731 736.0750 754.5908 785.0011 810.1041 821.0391 840.0782 864.9405 885.1511 898.4442 930.3477 952.1911 965.1932 991.4489 1002.0276 1011.9201 1038.1335 1054.0191 1055.0339 1063.9558 1091.9326 1097.0975 1101.4401 1137.8928 1166.3142 1168.6956 1190.4716 1213.4681 1229.4845 1233.3518 1259.9401 1282.7453 1287.8793 1296.4113 1311.5591 1312.2192 1326.4974 1342.6499 1346.9950 1360.9667 1365.3145 1382.1942 1400.1011 1447.7457 1448.7061 1463.8762 1465.3256 1475.0660 1476.4341 1486.8006 1517.3172 1577.6517 1600.8185 1625.4892 2947.1625 2959.2315 2963.5048 2967.6719 2975.5908 2980.8158 3005.4765 3027.8314 3044.4494 3063.2822 3073.5717 3179.9416 3188.9696 3201.0574 3217.9378 3560.8182
redmass: 6.8968 7.4971 6.9105 1.8369 8.5095 5.9387 9.8853 3.2960 3.8987 2.1760 5.4421 5.1067 6.3518 3.0680 3.5031 5.1711 4.8722 3.3566 1.5290 4.7464 3.9584 3.6034 11.2627 5.0434 4.3903 4.5099 7.1040 3.2175 3.6797 4.0607 6.1432 7.8696 5.7716 10.6663 7.6226 5.0035 1.1100 12.5196 1.2038 1.5987 2.0069 1.8449 1.4198 4.3623 1.6010 1.8582 2.7870 1.4043 2.8949 2.1182 1.3166 3.3517 2.6709 2.5752 2.4411 2.3708 1.3605 3.6471 1.3714 3.3512 2.7199 1.3153 4.8385 1.7979 1.4726 1.2677 1.2290 1.0726 1.7794 1.3003 1.2721 1.9025 1.5850 2.8070 1.8806 3.9637 1.2548 3.2175 1.3290 2.9313 1.0813 1.0724 1.4028 1.8035 1.0969 3.8922 5.4665 6.3420 7.2328 1.0691 1.0616 1.0618 1.0639 1.0682 1.0826 1.0949 1.0980 1.1010 1.0964 1.0979 1.0896 1.0920 1.0961 1.0794 1.0662
irintensity: 0.2666 1.6213 0.3668 4.2232 0.1996 1.3636 0.5425 1.7887 0.4308 1.5548 1.7166 4.8510 6.7813 4.8536 9.2940 5.3305 7.0369 6.1624 107.4692 19.2031 7.6085 17.3538 0.2371 7.5010 1.0730 4.9873 13.4475 5.2630 12.1722 1.6624 4.2763 16.8362 2.1461 11.4494 7.6088 1.4755 10.4469 10.7367 0.2211 32.6113 49.9470 34.5223 24.6753 7.9837 5.5256 9.4712 92.8204 25.1275 21.7591 24.0956 0.0871 27.6692 6.1588 19.9899 62.1632 4.8433 46.6928 60.1758 52.0772 174.8693 212.5432 28.8619 337.9976 153.0069 18.1433 9.4260 9.1198 3.8807 77.4967 10.2061 3.3699 73.2260 54.4048 131.3586 21.5230 39.5083 29.6692 21.8691 15.6141 4.7014 0.2281 1.4349 24.7161 24.1915 11.4714 125.2101 91.9753 33.3382 429.9802 50.0023 6.7171 11.6496 53.9444 65.4948 35.8889 10.7162 0.2125 67.4298 30.0332 63.4205 2.9920 19.9104 0.0732 68.8669 8.3058
temp: 298.150 k
press: 1.00000 atm
elementType: 8 8 8 8 8 7 7 7 7 6 6 6 6 6 6 6 6 6 6 6 6 1 1 1 1 1 1 1 1 1 1 1 1 1 1 1 1
symmnumber: 1
zpe: 739972.5 jmol-1
zpe.correction: 0.281841 hartree
zpe.thermalcorrener: 0.302854 hartree
zpe.thermalcorrenthalpy: 0.303798 hartree
zpe.thermalcorrgfe: 0.228151 hartree
zpe.sumelectzpe: -1060.220894 hartree
zpe.sumelectthermal: -1060.199881 hartree
zpe.sumelectthermalent: -1060.198937 hartree
zpe.sumelectthermalfe: -1060.274584 hartree
dipole: 7.0986 1.6612 3.8247
dipole: 8.2328
quadrupole: -166.4600 -139.5997 -123.5640
quadrupole: 10.0246 2.8275 -0.3144
quadrupole: -23.2521 3.6082 19.6439 10.0246 2.8275 -0.3144
hfenergy: -1060.5027348 hartree
pointgroup: C01 [X(C12H16N4O5)]
dipole: 2.8307046 0.7210768 1.399427 debye
polarizability: 335.5660729|41.2146166|193.4493831|47.1437133|-30.8110772|142.3005198 unknown
InChI: InChI=1S/C12H16N4O5/c17-8-4-2-1-3-7-13-14-11-6-5-10(15(18)19)9-12(11)16(20)21/h5-7,9,14,17H,1-4,8H2
charge 0 multiplicity 1
37 atoms
O  7.205862 -1.622768 -2.456211
O  -3.016948 2.782206 -1.689401
O  -0.895245 2.935967 -0.877458
O  -5.083669 -2.727071 0.492232
O  -5.84452 -0.987725 -0.780843
N  0.087532 1.018052 0.589669
N  1.088303 0.391788 1.335527
N  -2.039177 2.298332 -1.008121
N  -4.932567 -1.575402 -0.078837
C  4.633781 -0.526718 0.232577
C  4.68361 0.434391 1.44135
C  5.96881 -0.571327 -0.545115
C  3.359172 0.474447 2.254897
C  5.920577 -1.535397 -1.74528
C  2.214571 1.052453 1.467656
C  -1.128848 0.396919 0.420114
C  -2.191242 0.998753 -0.354104
C  -1.385198 -0.882982 1.015782
C  -3.435041 0.349809 -0.515377
C  -3.634613 -0.896666 0.087014
C  -2.611469 -1.521038 0.85582
H  3.813355 -0.224508 -0.450817
H  4.379133 -1.546661 0.587129
H  4.935207 1.457767 1.093373
H  5.501797 0.127146 2.121435
H  6.221161 0.450371 -0.902204
H  6.790612 -0.885923 0.127417
H  3.083683 -0.538198 2.600428
H  3.517885 1.101317 3.157318
H  5.101687 -1.242876 -2.439035
H  5.730116 -2.567718 -1.405166
H  2.370746 2.052345 1.012187
H  0.191399 1.947928 0.131682
H  -0.580924 -1.333809 1.599582
H  -4.224967 0.822385 -1.104684
H  -2.810707 -2.495549 1.309175
H  7.434536 -0.728839 -2.816711
