program: Gaussian 09
title: 000220686
version: EM64L-G09RevD.01
frameworkgroup: C1[X(C10H16N4O4S)]
method: RPBEPBE
basis: SDD
operation: Freq
keyword: #p
keyword: freq=noraman
keyword: PBEPBE/SDD
title: #p freq=noraman PBEPBE/SDD
converged: YES YES NO NO
title: Mulliken charges:
elementType: S O O O O N N N N C C C C C C C C C C H H H H H H H H H H H H H H H H
charge: 0.943943 -0.461680 -0.443039 -0.544357 -0.545140 -0.069818 -0.025307 -0.177428 -0.716359 -0.390282 -0.359665 -0.296516 -0.308424 -0.056061 0.193550 -0.217447 -0.218502 -0.284811 -0.342061 0.243110 0.253978 0.228545 0.268222 0.201785 0.231256 0.225585 0.211218 0.278346 0.282589 0.272805 0.253942 0.332180 0.331896 0.355376 0.348573
chargesum: 0.00000
title: Mulliken charges with hydrogens summed into heavy atoms:
elementType: S O O O O N N N N C C C C C C C C C C
charge: 0.943943 -0.106304 -0.094466 -0.544357 -0.545140 -0.069818 -0.025307 -0.177428 -0.052283 0.106806 0.137102 0.136524 0.128380 -0.056061 0.193550 0.060899 0.064088 -0.012007 -0.088119
polarizability: 3.37207219e+02 6.50418277e+00 1.54479364e+02 3.94799935e+00 2.22609537e+01 1.33381749e+02
1716.lowfreq: -4.9808 -1.9461 -0.0020 0.0003 0.0012 5.6603 15.3742 21.4928 32.1620
frequency: 15.3092 20.9329 31.8985 36.1354 46.9367 60.4405 80.0976 96.6453 110.5986 117.7369 131.1166 157.2339 174.4177 209.5289 229.7049 251.0926 256.9252 265.7490 300.8631 304.2685 312.0386 337.7696 371.4145 379.4298 384.4782 409.6474 415.0980 448.5752 473.2319 500.5256 517.6763 544.7110 590.5712 619.3626 656.5274 736.8590 761.2233 793.8590 810.4970 841.6487 842.8575 846.0571 863.3512 870.4256 905.3467 913.5495 961.9389 975.0622 986.1088 988.3515 1014.2516 1026.2932 1047.0007 1049.5819 1060.7048 1068.5885 1110.3289 1132.8303 1154.0643 1165.5575 1194.9105 1203.0213 1205.6190 1258.3905 1282.8392 1305.5860 1326.8515 1330.4301 1339.2753 1351.4915 1366.6590 1374.3310 1385.7972 1394.6007 1410.3642 1429.9228 1458.6741 1461.9229 1466.8408 1476.0576 1531.8762 1578.2870 1592.3311 2958.9537 2981.4671 3020.6846 3029.4818 3034.6318 3082.0412 3095.1511 3110.9541 3152.5683 3153.9223 3172.6205 3177.3053 3360.6091 3528.5411 3569.0942 3584.5145
redmass: 6.1939 6.0371 4.8308 3.8666 5.6278 6.0666 4.1654 3.4917 1.4967 4.2218 4.6562 5.1872 4.8067 5.9957 2.2718 1.8040 2.9065 2.8099 1.5688 3.1227 3.8341 3.5852 4.1226 4.3739 5.3567 3.9997 3.1176 4.6670 3.6988 2.5124 3.5110 2.9725 3.6226 6.9285 4.9438 3.4182 3.5410 3.3146 2.3938 2.3591 1.2634 3.4373 1.6318 2.8705 4.0667 2.4874 2.2086 1.3672 4.4957 1.3685 2.9915 3.5445 2.2234 2.1563 2.0121 1.4830 1.3135 1.9222 1.4364 1.1888 1.2700 1.8425 1.4417 1.6355 1.2683 1.7454 3.8336 1.2495 1.4775 1.3513 1.5516 1.4481 3.9671 1.4182 4.2213 1.1108 1.1003 2.0564 1.2393 1.0809 1.0856 6.9622 6.9345 1.0591 1.0651 1.0692 1.0632 1.0922 1.0993 1.1048 1.1020 1.0890 1.0881 1.0968 1.0958 1.0413 1.0998 1.0664 1.0667
irintensity: 0.2999 1.4079 3.6689 0.8119 2.1731 1.9707 8.1790 4.1297 39.5010 9.4348 1.9927 12.4041 5.0282 9.2523 27.2627 111.0024 40.3225 3.5853 144.6196 48.0481 8.0503 17.2481 2.9944 5.9259 0.6357 61.6122 2.6310 46.0851 152.3269 23.2508 6.0084 82.0016 17.8055 2.8518 18.2287 1.7320 1.7098 18.5527 288.2472 23.7744 1.1694 8.4901 59.8959 15.2792 60.0297 15.3306 63.7587 0.6620 1.9028 0.7926 91.6373 104.6898 49.8539 9.5016 3.5565 26.3457 6.8199 115.7579 16.4676 14.3326 4.9984 1.6614 60.6894 2.8617 0.2212 169.7881 373.2772 12.8540 18.7846 6.4928 129.0275 5.5146 16.1593 0.6771 15.9971 49.3087 11.4726 88.9925 15.3604 6.3405 17.3488 32.2453 32.5956 53.1591 36.2443 1.7585 22.1135 65.6390 44.4846 1.7465 4.4274 0.3055 2.1024 4.4601 1.3285 26.1318 22.3904 11.0008 5.2524
temp: 298.150 k
press: 1.00000 atm
elementType: 16 8 8 8 8 7 7 7 7 6 6 6 6 6 6 6 6 6 6 1 1 1 1 1 1 1 1 1 1 1 1 1 1 1 1
symmnumber: 1
zpe: 696966.2 jmol-1
zpe.correction: 0.265460 hartree
zpe.thermalcorrener: 0.287015 hartree
zpe.thermalcorrenthalpy: 0.287959 hartree
zpe.thermalcorrgfe: 0.211351 hartree
zpe.sumelectzpe: -1306.906476 hartree
zpe.sumelectthermal: -1306.884922 hartree
zpe.sumelectthermalent: -1306.883978 hartree
zpe.sumelectthermalfe: -1306.960585 hartree
dipole: 4.8318 -3.8786 2.8986
dipole: 6.8405
quadrupole: -140.3698 -113.3504 -116.5741
quadrupole: 0.2126 -9.6751 3.3215
quadrupole: -16.9384 10.0810 6.8573 0.2126 -9.6751 3.3215
hfenergy: -1307.1719367 hartree
pointgroup: C01[X(C10H16N4O4S1)]
dipole: -1.8586673 -1.4093759 -1.342318 debye
polarizability: 337.5396665|0.0460798|160.4660972|1.4560631|-17.8692515|127.0625686 unknown
InChI: InChI=1S/C10H16N4O4S/c11-19(17,18)10-3-1-9(2-4-10)12-13-14(5-7-15)6-8-16/h1-4,15-16H,5-8,11H2
charge 0 multiplicity 1
35 atoms
S  4.933811 0.513092 -0.035618
O  -4.774101 -1.977985 -1.439463
O  -4.988014 1.879272 1.522376
O  5.178035 2.116981 -0.193979
O  5.627197 -0.390751 1.130498
N  -3.172696 0.097692 -0.09169
N  -1.85381 0.382734 -0.218854
N  -1.049367 -0.54199 0.281671
N  5.450712 -0.241221 -1.643352
C  -3.675911 -1.146268 0.533926
C  -4.097344 1.089559 -0.679763
C  -3.740551 -2.323262 -0.448603
C  -4.352779 2.28545 0.260637
C  3.086106 0.213477 0.026585
C  0.333234 -0.210062 0.15651
C  2.23404 1.186866 -0.526311
C  2.625247 -0.95764 0.649682
C  0.846345 0.971224 -0.459306
C  1.23344 -1.162283 0.710675
H  -2.997032 -1.410611 1.3637
H  -4.688052 -0.94088 0.921907
H  -3.670087 1.452291 -1.631731
H  -5.038946 0.562769 -0.900301
H  -4.020243 -3.238961 0.114208
H  -2.751774 -2.475221 -0.923191
H  -5.072976 2.972399 -0.214942
H  -3.403393 2.829238 0.44365
H  2.652093 2.095331 -0.971894
H  3.331861 -1.667021 1.091322
H  0.14835 1.703334 -0.874115
H  0.817109 -2.054407 1.188403
H  5.863677 0.511239 -2.220183
H  6.12131 -0.998827 -1.429366
H  -4.808885 -2.669733 -2.145389
H  -4.307208 1.459974 2.106699
