program: Gaussian 09
title: 000220678
version: EM64L-G09RevD.01
frameworkgroup: C1[X(C14H15NO3)]
method: RPBEPBE
basis: SDD
operation: Freq
keyword: #p
keyword: freq=noraman
keyword: PBEPBE/SDD
title: #p freq=noraman PBEPBE/SDD
converged: YES YES NO NO
title: Mulliken charges:
elementType: O O O N C C C C C C C C C C C C C C H H H H H H H H H H H H H H H
charge: -0.266402 -0.359291 -0.213057 -0.026960 0.141566 0.268833 0.450416 -0.523186 -0.389075 -0.373937 0.093126 -0.814501 -0.808159 0.012831 0.205472 -0.249585 -0.200840 -0.665321 0.259344 0.237692 0.236159 0.248549 0.249688 0.232865 0.230570 0.242116 0.226595 0.236087 0.234069 0.221275 0.250080 0.232719 0.380263
chargesum: 0.00000
title: Mulliken charges with hydrogens summed into heavy atoms:
elementType: O O O N C C C C C C C C C C C C C C
charge: -0.266402 0.020971 -0.213057 -0.026960 0.141566 0.268833 0.450416 -0.263842 -0.151383 -0.137778 0.093126 -0.083400 -0.108877 0.012831 0.205472 0.220571 -0.200840 0.038753
polarizability: 2.31442165e+02 -4.93555387e+00 1.62829868e+02 -2.34302924e-02 -5.32830170e+00 1.26615932e+02
1716.lowfreq: -50.2035 -8.6822 -0.8065 -0.0005 0.0004 0.0007 6.9239 11.8649 24.1855
frequency: -50.0487 11.8509 24.1474 37.9422 58.9376 75.4189 96.1258 109.8575 118.7848 127.1351 147.4546 165.3831 214.6184 231.2821 277.4649 288.0745 311.2041 329.0031 355.0955 362.8637 413.3826 416.7004 450.7115 455.7877 481.0347 487.7724 544.4586 561.4303 574.4888 638.2954 649.6796 697.7429 727.6668 736.4657 755.4473 786.4346 819.6013 829.2827 842.1394 898.5010 923.4705 967.8970 989.7279 1007.3193 1012.0743 1045.9233 1048.8959 1052.6707 1095.7073 1125.5747 1153.4827 1156.5389 1177.9223 1197.4560 1220.0057 1271.2763 1277.7395 1288.3272 1347.0298 1359.9738 1368.9078 1391.2978 1395.4910 1399.5501 1413.5664 1455.6989 1464.0645 1467.8753 1469.7582 1473.2356 1481.8934 1484.3973 1492.4239 1569.5085 1576.6570 1618.1433 1630.6438 2156.8378 2979.2398 2979.3945 2995.2400 3031.9666 3057.8105 3060.3712 3089.4556 3091.1091 3091.3877 3098.4247 3119.9503 3124.6665 3131.6324 3143.9739 3448.6014
redmass: 1.0154 4.5737 5.2517 3.8274 4.8967 4.3746 3.9257 1.2035 4.1279 3.4984 4.9639 4.2765 1.4047 3.6947 2.4443 3.4376 3.7260 3.2996 7.2769 5.1617 4.3310 4.2284 3.3273 4.6105 4.3774 4.1319 3.1796 2.1177 2.7641 7.6326 6.1519 4.8185 4.0306 4.1033 7.5799 2.2826 1.8080 1.2921 4.0670 1.3994 2.8443 1.3432 1.6689 2.2117 1.5539 1.9421 2.0558 1.6742 2.1548 4.8450 1.9137 1.6650 2.6604 2.5889 1.8030 2.9060 1.1270 1.6260 1.4429 5.3300 2.5563 1.2325 3.0110 1.2190 1.2140 1.0987 1.0422 1.0845 1.0656 1.0588 1.1174 1.0524 2.9127 6.0953 8.4935 6.2846 9.7397 12.6244 1.0385 1.0392 1.0360 1.0603 1.0955 1.0957 1.0996 1.0977 1.0990 1.1026 1.0873 1.1064 1.0920 1.0970 1.0644
irintensity: 0.6516 2.1089 0.8527 0.4739 0.7368 0.6929 2.4929 1.5329 1.7794 0.3674 1.7018 1.3572 1.8584 3.1499 1.5385 2.6933 10.2341 2.2205 2.0442 1.7479 2.4289 8.1840 9.5229 3.4873 2.2262 5.7972 20.7405 42.4491 20.2098 11.7488 7.9696 2.6621 7.4551 6.9230 1.6524 9.0559 4.6378 33.0148 6.6139 0.9981 14.9850 0.3671 12.8089 23.8896 14.7168 32.8457 31.2340 13.6922 24.0026 290.4775 29.7911 23.2641 132.8176 135.3784 0.5859 4.5267 8.7969 5.4514 5.5605 0.8219 11.9689 23.0772 4.8315 11.8796 12.8056 16.1243 17.0226 8.7053 13.5402 15.7738 40.2250 9.9148 24.6259 31.8947 96.1928 5.4693 174.0602 22.9530 38.9250 8.9218 18.4679 24.4260 9.7915 18.4622 14.9580 47.4567 4.7749 2.1675 8.9177 20.2987 9.0717 23.3519 65.3355
temp: 298.150 k
press: 1.00000 atm
elementType: 8 8 8 7 6 6 6 6 6 6 6 6 6 6 6 6 6 6 1 1 1 1 1 1 1 1 1 1 1 1 1 1 1
symmnumber: 1
zpe: 673389.0 jmol-1
zpe.correction: 0.256480 hartree
zpe.thermalcorrener: 0.274860 hartree
zpe.thermalcorrenthalpy: 0.275804 hartree
zpe.thermalcorrgfe: 0.207353 hartree
zpe.sumelectzpe: -821.573440 hartree
zpe.sumelectthermal: -821.555061 hartree
zpe.sumelectthermalent: -821.554117 hartree
zpe.sumelectthermalfe: -821.622568 hartree
dipole: -2.7191 -1.4635 -0.1980
dipole: 3.0943
quadrupole: -80.5380 -109.8019 -114.3345
quadrupole: 5.0303 -7.8562 13.7352
quadrupole: 21.0202 -8.2438 -12.7764 5.0303 -7.8562 13.7352
hfenergy: -821.8299204 hartree
pointgroup: C01 [X(C14H15N1O3)]
dipole: -1.1142889 -0.2683326 0.4103809 debye
polarizability: 230.0626185|-8.6434901|131.19861|7.239787|-13.0251758|159.6267372 unknown
InChI: InChI=1S/C14H15NO3/c1-4-18-14(17)13(16)12(8-15)11-7-9(2)5-6-10(11)3/h5-7,16H,4H2,1-3H3
charge 0 multiplicity 1
33 atoms
O  3.115894 0.457293 -0.309226
O  0.529644 1.011881 2.107692
O  3.22002 1.398177 1.829563
N  1.022733 0.256182 -2.744546
C  -1.230064 0.42822 -0.058939
C  -1.81356 -0.639078 0.695258
C  -3.462587 1.400516 -0.512962
C  -2.055882 1.416528 -0.656992
C  -3.225361 -0.641788 0.840498
C  -4.034357 0.355931 0.258958
C  0.263984 0.520438 -0.24525
C  -0.981165 -1.765745 1.285715
C  -4.333349 2.448035 -1.182671
C  1.069282 0.792127 0.848799
C  2.565689 0.925766 0.873559
C  4.603219 0.564478 -0.453047
C  0.743178 0.382011 -1.585715
C  5.291064 -0.656933 0.161235
H  -1.582739 2.209956 -1.247671
H  -3.694274 -1.451317 1.412302
H  -5.122121 0.317916 0.39423
H  -0.266146 -2.166418 0.544979
H  -0.385327 -1.439332 2.159515
H  -1.629263 -2.59405 1.617511
H  -3.759813 3.358552 -1.426796
H  -4.757414 2.061846 -2.129619
H  -5.182741 2.740498 -0.539906
H  4.745452 0.620708 -1.543453
H  4.932798 1.50164 0.029196
H  6.378292 -0.604078 -0.03321
H  5.137705 -0.688423 1.252763
H  4.906192 -1.589642 -0.285194
H  -0.466286 1.019805 2.048623
