program: Gaussian 09
title: 000220668
version: EM64L-G09RevD.01
frameworkgroup: C1[X(C12H16N2O4)]
method: RPBEPBE
basis: SDD
operation: Freq
keyword: #p
keyword: freq=noraman
keyword: PBEPBE/SDD
title: #p freq=noraman PBEPBE/SDD
converged: YES YES YES YES
title: Mulliken charges:
elementType: O O O O N N C C C C C C C C C C C C H H H H H H H H H H H H H H H H
charge: -0.158211 -0.158222 -0.158209 -0.158224 -0.213089 -0.213089 -0.197219 -0.197233 -0.197220 -0.197208 0.217780 0.217783 0.217784 0.217780 -0.721321 -0.721320 -0.721317 -0.721317 0.260163 0.260172 0.260153 0.260145 0.253803 0.228801 0.222756 0.253804 0.228803 0.222754 0.222759 0.253801 0.228800 0.228799 0.222761 0.253800
chargesum: 0.00000
title: Mulliken charges with hydrogens summed into heavy atoms:
elementType: O O O O N N C C C C C C C C C C C C
charge: -0.158211 -0.158222 -0.158209 -0.158224 -0.213089 -0.213089 0.062944 0.062939 0.062933 0.062937 0.217780 0.217783 0.217784 0.217780 -0.015961 -0.015960 -0.015957 -0.015957
polarizability: 1.84667387e+02 -5.88768131e-04 1.62834974e+02 2.33436353e-03 1.15978536e-03 1.08803678e+02
1716.lowfreq: -15.5490 -10.4925 -8.2231 -0.0005 -0.0004 0.0007 32.6612 44.7114 69.5198
frequency: 32.5491 44.6802 69.5198 78.4744 85.4720 100.3728 177.0441 178.2693 183.0141 206.0330 206.2269 270.4367 274.0753 283.2921 287.5668 303.1536 310.9443 314.0041 318.1573 349.1081 366.2375 376.5742 424.8616 431.6295 450.7100 476.3468 512.3908 549.7629 647.0008 647.1131 689.8179 691.0641 696.3147 752.2410 806.4988 829.3957 854.2200 886.4888 901.9395 968.2990 968.8455 999.3541 1025.2650 1045.4092 1072.3650 1080.8260 1085.6211 1098.7331 1126.0733 1130.7260 1147.6643 1150.0748 1150.9109 1162.3029 1176.3919 1209.3730 1237.3893 1242.4701 1272.1672 1277.8121 1302.7343 1304.4849 1304.6693 1305.8110 1392.2980 1392.4445 1399.0847 1399.3189 1464.9677 1465.0470 1471.3235 1471.7015 1478.1339 1478.3093 1480.6844 1480.9107 1620.2875 1623.8179 1676.8338 1681.9089 2951.4265 2951.8771 2967.1335 2967.2708 2999.6817 2999.6864 3001.1791 3001.3964 3096.9736 3097.0285 3097.7448 3097.8035 3109.4270 3109.4969 3113.9949 3114.0334
redmass: 4.3361 6.6399 3.2255 3.5475 9.0797 10.2021 1.2698 1.0262 2.5918 1.2081 1.1996 3.4233 3.5415 3.5856 5.9633 2.0132 2.6407 3.4052 4.0573 4.5158 6.4881 7.5875 7.6071 9.2992 4.1609 5.3377 5.5832 6.7794 5.2039 3.8933 6.4271 4.2055 5.1431 3.0240 2.5414 3.7388 2.0773 2.2766 6.1420 1.3345 1.2240 3.6220 1.7958 1.6217 1.6782 2.4970 1.9461 2.6357 2.4501 4.7796 6.0768 3.2982 1.9864 2.5030 3.3988 2.8680 1.5154 1.9082 1.4477 1.5165 1.3481 1.3632 1.7853 1.8313 1.2013 1.2003 1.1930 1.1918 1.0418 1.0422 1.0539 1.0536 1.0503 1.0496 1.0463 1.0455 11.7124 11.9093 11.9744 11.9321 1.0801 1.0803 1.0828 1.0828 1.0364 1.0365 1.0368 1.0368 1.0993 1.0992 1.0991 1.0991 1.1008 1.1007 1.1000 1.1000
irintensity: 5.4365 2.1028 0.0000 1.0592 0.0000 2.6573 0.0040 0.0260 0.1273 0.0033 0.4860 0.4887 0.0000 0.6845 9.8396 8.1545 0.0000 5.0715 0.0080 0.0000 8.6373 25.8548 0.0000 2.8610 7.4389 1.6091 0.1059 0.0000 5.4556 0.0731 3.0032 13.6473 0.7688 0.0000 2.3418 1.7889 0.0000 4.5347 3.3772 4.1238 13.8663 8.8316 0.0000 20.2630 0.3611 0.0000 20.6852 1.0056 0.1515 0.0000 1153.0639 0.0033 18.7162 117.8749 0.0001 78.2830 1.6829 37.2570 111.0849 0.0000 0.0279 0.0000 0.0525 18.9140 3.2465 38.9446 54.6999 0.0080 0.1367 56.9269 20.6012 0.0002 2.8976 14.4595 6.9577 0.0045 32.3757 76.4191 549.3035 0.0000 8.4178 0.0010 2.8844 15.4477 1.6400 7.1437 69.1397 0.0053 8.6820 0.0187 10.0939 69.1535 6.0341 26.6558 21.6350 0.0030
temp: 298.150 k
press: 1.00000 atm
elementType: 8 8 8 8 7 7 6 6 6 6 6 6 6 6 6 6 6 6 1 1 1 1 1 1 1 1 1 1 1 1 1 1 1 1
symmnumber: 1
zpe: 703176.9 jmol-1
zpe.correction: 0.267826 hartree
zpe.thermalcorrener: 0.285922 hartree
zpe.thermalcorrenthalpy: 0.286867 hartree
zpe.thermalcorrgfe: 0.222108 hartree
zpe.sumelectzpe: -875.912480 hartree
zpe.sumelectthermal: -875.894383 hartree
zpe.sumelectthermalent: -875.893439 hartree
zpe.sumelectthermalfe: -875.958198 hartree
dipole: -0.0005 0.0000 -0.0001
dipole: 0.0005
quadrupole: -85.3911 -140.2753 -103.2351
quadrupole: 0.0016 0.0006 0.0001
quadrupole: 24.2427 -30.6415 6.3987 0.0016 0.0006 0.0001
hfenergy: -876.1803056 hartree
pointgroup: C01 [X(C12H16N2O4)]
dipole: -0.0002015 -0.0000011 0.0000391 debye
polarizability: 184.6673866|0.0023631|162.8349746|-0.0023345|0.0011596|108.8036775 unknown
InChI: InChI=1S/C12H16N2O4/c1-5-6(2)10(16)14-12(18)8(4)7(3)11(17)13(14)9(5)15/h5-8H,1-4H3
charge 0 multiplicity 1
34 atoms
O  -1.141772 -2.597965 0.843817
O  1.14212 -2.597748 -0.843191
O  -1.14209 2.597834 -0.843045
O  1.14191 2.597954 0.843829
N  0.000026 -0.721817 0.000346
N  -0.000056 0.721857 0.000497
C  -2.397057 -0.475353 0.621703
C  -2.397115 0.475075 -0.620818
C  2.397066 -0.474951 -0.621039
C  2.397085 0.475302 0.621624
C  -1.163455 -1.388408 0.539748
C  1.163564 -1.388157 -0.539246
C  -1.163651 1.388312 -0.538829
C  1.163441 1.388332 0.54001
C  -3.672443 -1.328863 0.760699
C  -3.672624 1.328397 -0.75984
C  3.672535 -1.328309 -0.760205
C  3.672453 1.328841 0.760611
H  -2.290724 0.156487 1.53067
H  -2.290669 -0.156748 -1.529784
H  2.290649 0.157003 -1.529915
H  2.290885 -0.156668 1.530515
H  -3.552365 -2.062767 1.574414
H  -4.545087 -0.693242 0.98324
H  -3.873145 -1.894336 -0.166921
H  -3.552638 2.06232 -1.573551
H  -4.545169 0.692646 -0.9824
H  -3.873428 1.893839 0.167777
H  3.873323 -1.893906 0.167322
H  3.552509 -2.062099 -1.574031
H  4.545108 -0.692565 -0.982671
H  4.545148 0.693221 0.982956
H  3.87303 1.894466 -0.166945
H  3.552436 2.062615 1.574453
