program: Gaussian 09
title: 000220654
version: EM64L-G09RevD.01
frameworkgroup: C1[X(C16H8O4)]
method: RPBEPBE
basis: SDD
operation: Freq
keyword: #pfreq=noraman
keyword: PBEPBE/SDD
title: #p freq=noraman PBEPBE/SDD
converged: NO NO NO NO
title: Mulliken charges:
elementType: O O O O C C C C C C C C C C C C C C C C H H H H H H H H
charge: -0.290089 -0.290089 -0.165073 -0.165073 0.182974 0.182975 0.220027 0.220027 0.099369 0.099370 0.081236 0.081236 -0.361821 -0.361821 -0.371360 -0.371360 -0.215420 -0.215420 -0.222600 -0.222601 0.294332 0.294332 0.268045 0.268045 0.239829 0.239829 0.240551 0.240551
chargesum: 0.00000
title: Mulliken charges with hydrogens summed into heavy atoms:
elementType: O O O O C C C C C C C C C C C C C C C C
charge: -0.290089 -0.290089 -0.165073 -0.165073 0.182974 0.182975 0.220027 0.220027 0.099369 0.099370 0.081236 0.081236 -0.067489 -0.067489 -0.103315 -0.103315 0.024408 0.024408 0.017950 0.017950
polarizability: 3.88992988e+02 -5.47058132e+00 2.20774236e+02 7.93547500e-04 -3.18112811e-05 6.83005431e+01
1716.lowfreq: -2.9206 -0.0008 -0.0008 -0.0003 12.2692 15.6186 48.4144 58.9005 71.9902
frequency: 48.4144 58.9005 71.9902 128.3921 148.2883 164.4427 179.4286 201.1835 240.4318 270.4154 275.0162 326.7919 401.0662 419.2384 422.2544 447.1351 505.4128 532.3582 553.0583 562.2863 563.7917 567.7977 639.4270 658.0286 661.2293 665.0345 679.7096 719.2122 722.1498 761.8695 767.7300 768.3528 785.7343 787.6619 856.4585 864.3289 900.4835 902.1941 914.5579 977.6221 977.8616 1008.5557 1008.6101 1011.5512 1013.4092 1061.7569 1069.9495 1093.3096 1107.4970 1170.9179 1173.4628 1181.1700 1188.2388 1248.1506 1271.5002 1297.7331 1303.1969 1405.3690 1413.2006 1445.1262 1450.6808 1457.5255 1463.2189 1591.3263 1593.7285 1611.6027 1614.7307 1678.0072 1723.2739 1735.1224 3140.6240 3140.6490 3153.8198 3153.8311 3168.8531 3168.9747 3184.3761 3184.3905
redmass: 6.6438 6.5082 6.8193 4.4249 5.7709 10.9053 6.4914 6.8104 6.3303 11.4837 7.7098 7.3353 7.0980 3.1254 3.2292 4.9324 7.4344 8.3759 7.9529 4.4127 9.5270 11.0910 4.9533 5.2135 8.4335 5.1570 11.0791 6.7136 6.9220 4.5037 11.5389 4.9164 1.3686 1.4090 7.6015 8.6374 1.3616 1.3649 8.7770 1.3903 1.3896 1.3419 1.3404 2.5968 2.3350 3.8228 4.1009 2.5962 2.6663 1.1983 1.2959 1.5593 2.1251 3.4107 2.3080 1.9290 1.8171 6.7042 6.7225 2.4885 2.5613 2.6351 2.8978 7.0528 7.3623 7.2319 7.3168 12.0025 12.9967 12.8393 1.0867 1.0867 1.0917 1.0917 1.0978 1.0977 1.0975 1.0975
irintensity: 6.1453 0.9447 2.5119 0.0000 0.7495 0.0000 0.0000 0.0000 0.0318 0.0000 8.1143 0.0000 0.0847 0.0000 3.6764 0.0000 0.5824 0.0000 19.2771 18.1216 0.0000 4.1865 0.0000 47.7744 0.0001 0.0000 14.0031 0.0000 66.4865 22.0630 0.0000 0.0000 131.2735 0.0000 270.5355 0.0000 0.0000 0.7755 291.4111 0.0000 4.8516 0.2514 0.0000 0.0000 23.7334 0.0000 97.3952 0.0000 34.1524 15.2191 0.0000 0.0000 29.6324 0.0000 32.2194 9.0202 0.0000 83.1987 0.0000 0.0000 9.6351 0.0000 143.0642 9.4657 0.0000 0.0000 37.5231 0.0000 1135.6006 0.0000 2.8157 0.0000 0.1391 12.8448 38.3792 0.0051 12.8281 0.4181
temp: 298.150 k
press: 1.00000 atm
elementType: 8 8 8 8 6 6 6 6 6 6 6 6 6 6 6 6 6 6 6 6 1 1 1 1 1 1 1 1
symmnumber: 1
zpe: 513109.3 jmol-1
zpe.correction: 0.195433 hartree
zpe.thermalcorrener: 0.209992 hartree
zpe.thermalcorrenthalpy: 0.210936 hartree
zpe.thermalcorrgfe: 0.153402 hartree
zpe.sumelectzpe: -914.079795 hartree
zpe.sumelectthermal: -914.065236 hartree
zpe.sumelectthermalent: -914.064292 hartree
zpe.sumelectthermalfe: -914.121826 hartree
dipole: 0.0000 0.0000 -0.0005
dipole: 0.0005
quadrupole: -83.5548 -127.0573 -116.1770
quadrupole: 24.3897 0.0001 0.0002
quadrupole: 25.3749 -18.1276 -7.2473 24.3897 0.0001 0.0002
hfenergy: -914.2752278 hartree
pointgroup: C01 [X(C16H8O4)]
dipole: 0.0000034 0. -0.0001828 debye
polarizability: 388.9673285|-5.8517482|220.7998948|-0.0007935|0.0000336|68.3005431 unknown
InChI: InChI=1S/C16H8O4/c17-15-11-7-3-1-5-9(11)13(19-15)14-10-6-2-4-8-12(10)16(18)20-14/h1-8H
charge 0 multiplicity 1
28 atoms
O  0.818407 -1.661137 0.000334
O  -0.818393 1.661137 0.000333
O  2.68786 -3.103119 0.000459
O  -2.687846 3.103119 0.000482
C  0.636891 -0.253071 0.000319
C  -0.636877 0.253071 0.000319
C  1.939486 0.404243 0.000328
C  -1.939471 -0.404243 0.000327
C  2.930496 -0.618312 0.000344
C  -2.930482 0.618312 0.000345
C  2.270117 -1.939874 0.0002
C  -2.270102 1.939874 0.00019
C  2.308857 1.767839 0.000352
C  -2.308843 -1.767839 0.000354
C  4.304781 -0.31387 0.000434
C  -4.304766 0.31387 0.000453
C  3.690594 2.073914 0.000419
C  -3.69058 -2.073914 0.000436
C  4.678304 1.050772 0.00046
C  -4.67829 -1.050772 0.000485
H  1.54912 2.553431 0.000359
H  -1.549105 -2.553431 0.000357
H  5.055282 -1.110945 0.000453
H  -5.055268 1.110945 0.000478
H  4.00476 3.123317 0.000448
H  -4.004745 -3.123317 0.000471
H  5.739434 1.321733 0.000511
H  -5.73942 -1.321733 0.00055
