program: Gaussian 09
title: 000220650
version: EM64L-G09RevD.01
frameworkgroup: C1[X(C13H20S)]
method: RPBEPBE
basis: SDD
operation: Freq
keyword: #pfreq=noraman
keyword: PBEPBE/SDD
title: #p freq=noraman PBEPBE/SDD
converged: YES YES NO NO
title: Mulliken charges:
elementType: S C C C C C C C C C C C C C H H H H H H H H H H H H H H H H H H H H
charge: 0.170141 -0.357410 -0.347030 -0.331328 -0.354429 -0.676218 -0.694367 -0.195205 -0.218101 -0.247805 0.445009 -0.379215 -0.373907 -0.804518 0.188565 0.188897 0.188645 0.188661 0.208443 0.210020 0.194720 0.194639 0.261060 0.254876 0.210291 0.210288 0.215780 0.247153 0.253184 0.230641 0.231070 0.225940 0.235994 0.225516
chargesum: 0.00000
title: Mulliken charges with hydrogens summed into heavy atoms:
elementType: S C C C C C C C C C C C C C
charge: 0.170141 0.020053 0.030275 0.087135 0.034929 -0.160283 -0.058007 -0.195205 0.029052 0.005379 0.445009 -0.148574 -0.142837 -0.117067
polarizability: 2.30368670e+02 -1.90979238e+01 1.26778088e+02 9.68113690e+00 9.93791427e+00 1.27969580e+02
1716.lowfreq: -5.4987 -2.2738 0.0019 0.0024 0.0026 4.4110 9.3345 19.5461 32.0302
frequency: 3.7043 19.2231 31.8487 32.8723 51.6847 77.9268 84.8129 119.8081 134.9203 137.0430 191.4252 225.4202 228.4622 255.5105 317.2356 358.1155 362.0474 407.9014 424.5041 436.1890 503.7799 609.9469 631.7156 692.0735 716.0738 725.8175 741.2694 785.5514 788.0855 822.6926 848.2403 869.8615 889.3938 954.7004 971.0079 974.6697 984.7405 1004.2882 1006.1908 1030.7296 1046.9386 1057.0793 1066.3282 1076.7740 1080.5820 1111.9675 1115.3455 1185.4129 1189.6182 1217.8120 1219.4714 1236.7445 1260.4180 1278.3955 1288.2026 1291.3098 1295.2184 1313.2164 1347.4955 1354.5024 1359.4670 1388.7620 1391.5522 1396.7800 1453.2200 1464.9381 1466.3420 1470.3189 1473.9443 1474.0021 1476.2440 1479.6215 1482.3896 1488.8882 1575.5669 1604.6749 2954.7632 2958.9728 2968.6358 2972.3235 2975.2025 2978.1542 2991.5737 3006.5151 3014.1270 3026.6893 3043.0532 3056.3765 3068.9798 3071.4710 3085.7613 3090.5788 3120.1714 3122.5700 3148.1184 3156.2975
redmass: 3.4877 1.0731 2.5588 2.7732 2.6268 1.8984 3.7520 2.1746 2.6206 2.6747 4.5507 1.1547 4.1953 3.7477 4.2903 2.9481 5.0553 2.8574 3.6676 3.5002 2.7157 5.6939 6.9643 5.4218 3.4351 1.0658 1.0901 1.1664 4.9360 1.3905 1.2437 1.2150 1.8902 1.3104 1.1905 1.3794 1.4064 4.1082 3.8211 3.6504 1.5676 1.0907 2.7865 2.8995 2.2699 1.3260 2.3547 1.1245 1.7074 1.2501 2.8491 1.3563 1.2654 1.1607 1.0648 1.2902 1.0993 1.3422 1.4827 1.6420 4.9031 1.2160 3.2534 1.2247 1.0920 1.0658 1.0768 1.0905 1.0539 1.0718 1.0425 2.4983 1.0800 1.0908 6.2020 6.2477 1.0589 1.0590 1.0590 1.0366 1.0388 1.0589 1.0979 1.1013 1.0560 1.1037 1.1046 1.0947 1.1007 1.0993 1.0998 1.1091 1.0884 1.0887 1.0958 1.0962
irintensity: 0.3888 0.3505 0.2349 0.2258 0.6100 0.2209 0.2166 0.2385 0.4951 0.4909 0.3037 0.0057 0.2625 0.3353 0.2707 0.4854 0.5366 0.0945 0.2297 0.7575 31.9994 2.9701 0.0105 8.1098 1.2663 12.3270 0.8845 3.8592 1.5921 52.0887 0.5611 0.2179 3.4934 0.9509 1.0688 0.0643 0.2069 18.0084 0.4116 3.4422 17.6583 0.2175 1.9690 1.8443 0.7470 10.7806 19.2702 3.2387 0.1562 3.4170 3.3815 0.0446 13.6926 0.1494 0.2545 0.7228 0.3413 10.0877 3.1816 1.0625 0.0660 11.1256 2.8096 10.9707 3.6230 0.7492 0.2864 13.4368 12.5809 1.9374 12.4571 47.1570 2.5662 22.5906 0.3649 1.1271 0.2833 6.5859 67.4682 38.0134 38.5557 58.3885 0.1858 0.0699 28.8865 8.1031 70.3949 24.2489 89.8268 54.2663 17.7211 38.4380 12.3768 21.3189 19.2840 3.7767
temp: 298.150 k
press: 1.00000 atm
elementType: 16 6 6 6 6 6 6 6 6 6 6 6 6 6 1 1 1 1 1 1 1 1 1 1 1 1 1 1 1 1 1 1 1 1
symmnumber: 1
zpe: 770044.4 jmol-1
zpe.correction: 0.293294 hartree
zpe.thermalcorrener: 0.310255 hartree
zpe.thermalcorrenthalpy: 0.311199 hartree
zpe.thermalcorrgfe: 0.242766 hartree
zpe.sumelectzpe: -904.357579 hartree
zpe.sumelectthermal: -904.340618 hartree
zpe.sumelectthermalent: -904.339674 hartree
zpe.sumelectthermalfe: -904.408107 hartree
dipole: 0.2004 -2.1322 0.6093
dipole: 2.2266
quadrupole: -82.3276 -97.7174 -91.0042
quadrupole: -4.8156 2.3555 3.9845
quadrupole: 8.0222 -7.3677 -0.6545 -4.8156 2.3555 3.9845
hfenergy: -904.650873 hartree
pointgroup: C01 [X(C13H20S1)]
dipole: 0.0793343 0.8657433 0.107525 debye
polarizability: 230.314872|21.4761589|119.8168505|-2.2503576|6.2694589|134.9846152 unknown
InChI: InChI=1S/C13H20S/c1-3-4-5-6-11-14-13-9-7-12(2)8-10-13/h7-10H,3-6,11H2,1-2H3
charge 0 multiplicity 1
34 atoms
S  0.304623 -1.663044 -0.273099
C  -3.400561 0.392946 0.055866
C  -4.856595 -0.120159 -0.02559
C  -2.35678 -0.735232 -0.129149
C  -5.907699 0.996903 0.16666
C  -0.915272 -0.20706 -0.061664
C  -7.359447 0.47792 0.081294
C  1.904446 -0.748873 -0.14571
C  2.39818 -0.332959 1.113377
C  2.668958 -0.501321 -1.309455
C  4.416251 0.597424 0.042122
C  3.638652 0.33747 1.201058
C  3.914356 0.160223 -1.210894
C  5.738575 1.338916 0.138329
H  -3.240548 0.887568 1.036518
H  -3.243341 1.173045 -0.717842
H  -5.013101 -0.905541 0.743091
H  -5.019017 -0.610187 -1.008243
H  -2.505125 -1.507114 0.652521
H  -2.52238 -1.234324 -1.104838
H  -5.749105 1.782662 -0.60015
H  -5.744947 1.48474 1.149511
H  -0.708119 0.517087 -0.868223
H  -0.702238 0.266352 0.912448
H  -7.553503 -0.286593 0.857229
H  -7.55669 0.012838 -0.903098
H  -8.090957 1.294942 0.221547
H  1.821383 -0.549713 2.019254
H  2.290093 -0.831181 -2.282436
H  4.012315 0.652346 2.183211
H  4.501697 0.339731 -2.119816
H  6.437006 1.027414 -0.658228
H  5.58952 2.431603 0.035211
H  6.230868 1.166574 1.11169
