program: Gaussian 09
title: 000220645
version: EM64L-G09RevD.01
frameworkgroup: C1[X(C8H17NO2)]
method: RPBEPBE
basis: SDD
operation: Freq
keyword: #p
keyword: freq=noraman
keyword: PBEPBE/SDD
title: #p freq=noraman PBEPBE/SDD
converged: NO YES NO NO
title: Mulliken charges:
elementType: O O N C C C C C C C C H H H H H H H H H H H H H H H H H
charge: -0.206640 -0.217520 0.135417 -0.373552 -0.399339 -0.367202 -0.066769 -0.355256 -0.356201 -0.693340 -0.695048 0.195538 0.218718 0.204805 0.234021 0.187376 0.196172 0.246775 0.194339 0.188759 0.193969 0.196551 0.236256 0.244303 0.219758 0.216250 0.211904 0.209955
chargesum: 0.00000
title: Mulliken charges with hydrogens summed into heavy atoms:
elementType: O O N C C C C C C C C
charge: -0.206640 -0.217520 0.135417 0.040703 0.039487 0.016346 0.180007 0.027842 0.034320 0.006978 -0.056939
polarizability: 1.16040130e+02 2.05505120e+00 9.61381117e+01 1.44183523e-01 -4.12114907e+00 9.25874967e+01
1716.lowfreq: -0.0008 -0.0007 -0.0007 4.3216 9.6860 14.5914 34.3364 37.2623 45.9655
frequency: 34.2417 37.2058 45.7836 69.9700 92.7620 115.8503 137.3971 175.2251 196.5028 214.2354 225.3642 280.1964 295.4320 310.1350 426.0860 461.6216 517.6757 590.2202 677.5574 722.3205 737.2761 772.2442 796.2898 878.2688 885.1329 908.4109 964.9454 996.9620 1011.4493 1033.7814 1068.1466 1074.5057 1083.7328 1112.0948 1125.8241 1158.0153 1194.1302 1223.1728 1235.0385 1250.2194 1274.6808 1280.0320 1288.4188 1293.8794 1304.7227 1316.8817 1341.7922 1358.0735 1361.9539 1388.0453 1389.6298 1429.4197 1449.7112 1462.9858 1464.9297 1466.9818 1472.6525 1476.6566 1480.1361 1481.3013 1488.3696 2954.4842 2958.4291 2967.1232 2970.9794 2974.9250 2985.4699 2991.1669 2998.3547 3004.5712 3021.4064 3036.4416 3049.1800 3063.7130 3071.3900 3073.8359 3097.3580 3110.2228
redmass: 10.4673 2.3858 2.3592 3.5195 2.7576 1.7545 2.3452 2.6495 1.0456 2.8715 1.1518 3.4450 4.1131 3.3164 3.3521 3.4984 3.7077 2.7460 5.0899 1.0746 1.1773 3.4685 1.4807 1.2760 1.9455 1.9890 1.2852 2.6701 1.8799 2.3302 2.2684 2.0303 2.0020 1.9136 2.6425 2.2402 1.7041 2.5031 1.3480 1.7365 1.5437 1.2859 1.0901 1.1956 1.1069 1.3105 1.4525 1.5992 1.5727 1.2373 1.2176 3.1291 1.1215 1.0749 1.0771 1.0676 1.0757 1.0426 1.0581 1.0736 1.0891 1.0590 1.0591 1.0598 1.0598 1.0362 1.0613 1.0957 1.0356 1.0998 1.1019 1.1028 1.0959 1.0955 1.1005 1.0994 1.1001 1.1004
irintensity: 0.0348 1.0339 1.1585 0.5821 0.6806 0.2499 0.3112 0.4395 0.0906 0.3182 0.0046 2.7005 3.2039 1.1654 0.7279 0.1824 5.2654 1.1128 0.6440 13.9437 0.7242 21.1531 0.7086 0.5788 7.2671 0.5669 0.2641 1.2520 3.8378 2.5583 6.3800 4.5675 4.5582 9.5919 8.1353 7.5232 7.5613 23.3021 6.5931 16.5641 32.8802 3.7500 4.9038 7.0251 2.2653 1.0756 0.5289 2.1776 0.4696 25.7731 12.4367 101.6562 3.3035 2.6761 0.9935 4.9751 3.0008 12.3733 12.9139 5.7991 23.8576 1.7589 4.3645 8.6180 100.2970 38.1110 34.2606 4.0107 20.3157 0.5104 0.3793 44.4921 34.9001 32.0916 94.3515 53.3650 22.3840 17.9528
temp: 298.150 k
press: 1.00000 atm
elementType: 8 8 7 6 6 6 6 6 6 6 6 1 1 1 1 1 1 1 1 1 1 1 1 1 1 1 1 1
symmnumber: 1
zpe: 638421.4 jmol-1
zpe.correction: 0.243162 hartree
zpe.thermalcorrener: 0.257087 hartree
zpe.thermalcorrenthalpy: 0.258031 hartree
zpe.thermalcorrgfe: 0.200569 hartree
zpe.sumelectzpe: -519.258770 hartree
zpe.sumelectthermal: -519.244845 hartree
zpe.sumelectthermalent: -519.243901 hartree
zpe.sumelectthermalfe: -519.301362 hartree
dipole: 1.2434 -3.7806 -1.2154
dipole: 4.1613
quadrupole: -71.0203 -72.9450 -71.2605
quadrupole: 10.4305 3.6646 0.9427
quadrupole: 0.7216 -1.2030 0.4814 10.4305 3.6646 0.9427
hfenergy: -519.5019315 hartree
pointgroup: C01 [X(C8H17N1O2)]
dipole: -0.5067684 1.5009357 -0.4131413 debye
polarizability: 115.987966|2.2971154|95.8228889|-0.0776729|4.2625357|92.9548836 unknown
InChI: InChI=1S/C8H17NO2/c1-3-4-5-6-7-8(2)9(10)11/h8H,3-7H2,1-2H3
charge 0 multiplicity 1
28 atoms
O  2.698682 -1.765388 -0.818163
O  2.716684 -0.972965 1.320522
N  2.586988 -0.82115 0.04941
C  -0.287055 0.133169 -0.328745
C  0.894237 1.0309 0.099726
C  -1.64297 0.658296 0.195134
C  2.262985 0.599112 -0.470142
C  -2.838117 -0.228867 -0.219652
C  -4.195731 0.296729 0.300366
C  3.414814 1.536634 -0.069256
C  -5.385725 -0.593566 -0.118003
H  -0.321074 0.065329 -1.435654
H  -0.130464 -0.898991 0.043502
H  0.716181 2.068499 -0.24662
H  0.968587 1.066034 1.203748
H  -1.807312 1.69159 -0.176446
H  -1.605638 0.727367 1.302207
H  2.211487 0.466258 -1.564797
H  -2.677853 -1.260746 0.155865
H  -2.875251 -0.30373 -1.32661
H  -4.35491 1.328756 -0.074039
H  -4.158204 0.369665 1.406515
H  4.378924 1.194628 -0.483351
H  3.501135 1.593945 1.028739
H  3.211013 2.548214 -0.461684
H  -6.343194 -0.198116 0.267677
H  -5.26534 -1.623094 0.268225
H  -5.465577 -0.657011 -1.21957
