program: Gaussian 09
title: 000220658
version: EM64L-G09RevD.01
frameworkgroup: C1[X(C19H17NO2)]
method: RPBEPBE
basis: SDD
operation: Freq
keyword: #p
keyword: freq=noraman
keyword: PBEPBE/SDD
title: #p freq=noraman PBEPBE/SDD
converged: YES YES NO NO
title: Mulliken charges:
elementType: O O N C C C C C C C C C C C C C C C C C C C H H H H H H H H H H H H H H H H H
charge: -0.480086 -0.280472 -0.410269 -0.319551 0.242599 0.186687 0.454941 0.428218 0.179984 -0.382372 -0.464713 -0.426423 -0.391233 -0.395842 -0.440314 -0.262572 -0.249620 0.244426 -0.236575 -0.231256 -0.250270 -0.782083 0.269000 0.349282 0.242033 0.241188 0.218584 0.245472 0.245140 0.240639 0.230682 0.230538 0.222801 0.222907 0.226353 0.366036 0.252023 0.250492 0.213625
chargesum: 0.00000
title: Mulliken charges with hydrogens summed into heavy atoms:
elementType: O O N C C C C C C C C C C C C C C C C C C C
charge: -0.114050 -0.280472 -0.060987 -0.050551 0.242599 0.186687 0.454941 0.428218 0.179984 -0.140340 -0.223525 -0.207839 -0.145761 -0.150702 -0.199675 -0.031891 -0.019083 0.244426 -0.013774 -0.008349 -0.023917 -0.065943
polarizability: 2.66459985e+02 -1.11926891e+01 1.83288695e+02 -1.67016037e+01 -4.34055566e+00 2.07064162e+02
1716.lowfreq: -9.0111 -7.5436 -0.0006 -0.0003 0.0007 2.3256 14.6971 29.2589 36.7918
frequency: 14.4077 29.2446 36.6736 52.0805 61.5208 75.6602 87.0388 118.9288 135.2934 177.9045 222.5717 227.1873 229.2751 281.9320 299.4995 316.5346 346.0639 361.3778 404.0931 417.0295 424.0809 433.0409 482.6278 485.0983 521.9277 528.7857 556.4844 574.0478 607.3676 616.9394 623.0817 641.6675 678.8793 695.0861 702.2872 711.0891 740.2901 754.0822 768.4824 783.1123 806.3725 833.5884 855.6324 867.3124 876.5406 906.7026 920.7175 939.7221 963.7389 967.0689 980.2199 984.0311 990.0140 991.9063 994.8492 1027.4148 1033.5345 1041.2988 1047.0187 1076.8792 1110.3587 1149.5904 1161.9932 1170.4945 1177.0929 1185.3513 1192.7505 1214.3453 1229.3954 1240.1854 1253.3656 1262.8336 1278.9488 1310.4827 1325.7120 1368.6651 1381.3067 1386.3154 1404.3533 1422.8006 1433.7785 1437.1254 1451.6614 1461.3108 1468.6691 1479.7993 1485.0931 1519.6205 1590.1484 1591.2153 1606.9264 1609.6069 1613.1247 1635.6963 2995.9514 3013.3915 3096.4860 3100.7807 3112.0631 3120.1013 3122.2329 3128.0422 3137.3989 3141.5159 3144.9084 3149.2009 3155.7689 3162.7466 3170.2590 3529.7257 3597.6642
redmass: 4.7304 4.1330 4.2207 4.5914 1.5778 4.5374 2.0622 5.2322 4.3193 4.7722 4.5594 6.9779 4.7431 4.6435 1.2728 3.0133 5.1494 4.9895 2.8395 3.1074 5.6108 4.5654 3.6474 3.6118 5.8370 3.5221 3.6863 3.1806 4.3169 6.0944 4.5579 5.5527 2.8839 2.7185 2.5412 1.5379 2.0932 1.3697 3.3889 3.1208 1.4634 3.3758 1.2579 3.1189 1.9991 5.3559 1.5890 1.3398 2.1181 2.0844 1.3957 1.6397 5.5916 1.3583 1.3415 2.2729 2.2509 1.6524 3.0824 1.8804 2.8508 1.4518 1.1804 1.0546 1.1567 1.4910 1.6923 1.8588 1.8626 2.3020 1.8963 1.6057 1.5753 1.4615 1.5910 2.4518 6.0604 1.2575 3.2162 3.5527 2.4088 2.7968 1.0486 1.6006 1.5122 2.1700 1.9934 3.7608 7.6853 6.2521 6.1773 5.9563 5.9629 6.6493 1.0357 1.0802 1.0986 1.1003 1.0877 1.0842 1.0870 1.0875 1.0890 1.0919 1.0966 1.0956 1.0945 1.1013 1.0986 1.0785 1.0663
irintensity: 0.3897 0.4719 0.7143 1.8397 6.1977 3.7090 3.7981 0.6646 0.0516 2.3169 6.2427 5.0127 1.6206 1.0746 96.3223 19.0836 4.6376 1.2811 0.1761 2.6410 4.1683 1.6151 12.3676 39.8025 0.7375 1.7506 2.9808 13.1879 2.7768 0.4749 12.6849 1.7414 19.1595 22.1454 47.1197 73.9473 48.2583 23.6262 29.0112 13.3199 76.4920 20.3570 0.2448 19.7646 4.4406 30.6314 2.8136 1.0973 15.3554 9.8204 0.3934 3.2204 0.2276 0.3135 0.2998 21.5558 5.4949 12.7037 62.0226 6.9753 6.6100 54.9658 22.3683 0.3147 0.7890 12.6774 3.3738 7.1984 50.7219 54.1467 21.9622 10.0715 14.6819 69.0502 91.5609 10.8283 0.3369 73.5280 8.4784 2.9288 0.8923 8.7562 17.2143 105.0061 22.8176 28.6587 180.8672 33.7671 8.1140 4.3972 117.6230 36.1423 19.5756 36.3860 12.5169 22.5031 11.2724 17.2876 9.7817 1.5974 3.5302 2.5217 7.2317 22.0290 20.9341 40.1393 33.8075 25.3425 17.0275 54.1609 49.2547
temp: 298.150 k
press: 1.00000 atm
elementType: 8 8 7 6 6 6 6 6 6 6 6 6 6 6 6 6 6 6 6 6 6 6 1 1 1 1 1 1 1 1 1 1 1 1 1 1 1 1 1
symmnumber: 1
zpe: 812358.2 jmol-1
zpe.correction: 0.309411 hartree
zpe.thermalcorrener: 0.328659 hartree
zpe.thermalcorrenthalpy: 0.329603 hartree
zpe.thermalcorrgfe: 0.259478 hartree
zpe.sumelectzpe: -937.908527 hartree
zpe.sumelectthermal: -937.889279 hartree
zpe.sumelectthermalent: -937.888335 hartree
zpe.sumelectthermalfe: -937.958460 hartree
dipole: 0.9948 -1.4732 5.1079
dipole: 5.4084
quadrupole: -113.2119 -129.6412 -117.3572
quadrupole: -3.9667 -3.5316 8.3869
quadrupole: 6.8582 -9.5711 2.7129 -3.9667 -3.5316 8.3869
hfenergy: -938.2179379 hartree
pointgroup: C01 [X(C19H17N1O2)]
dipole: 0.3433264 -0.2887778 -2.0799821 debye
polarizability: 265.3390525|20.8761131|185.7804651|8.525001|5.976786|205.6933249 unknown
InChI: InChI=1S/C19H17NO2/c1-13(21)20-19(15-8-3-2-4-9-15)18-16-10-6-5-7-14(16)11-12-17(18)22/h2-12,19-20,22H,1H3
charge 0 multiplicity 1
39 atoms
O  -0.710027 -1.360777 -2.188164
O  -1.188687 -1.942528 2.75252
N  -1.41486 -1.687392 0.448675
C  -0.815979 -0.339929 0.426871
C  0.493936 -0.333778 -0.370637
C  1.728725 0.183364 0.171082
C  -1.818124 0.736005 -0.042062
C  2.930515 0.179922 -0.64892
C  0.503822 -0.833879 -1.68244
C  1.833193 0.722039 1.500864
C  2.870971 -0.340146 -1.981041
C  1.678366 -0.844988 -2.4927
C  -1.371587 1.934393 -0.652505
C  -3.203855 0.575975 0.208292
C  4.157794 0.698294 -0.119304
C  3.043027 1.221187 1.987904
C  4.219924 1.212426 1.175538
C  -1.527918 -2.413812 1.620714
C  -2.290273 2.945744 -1.013369
C  -4.12387 1.584373 -0.153621
C  -3.671566 2.775088 -0.767846
C  -2.093485 -3.822785 1.467735
H  -0.597978 -0.14501 1.493632
H  -1.645715 -2.095861 -0.460498
H  0.957678 0.736651 2.155651
H  3.778504 -0.340302 -2.595218
H  1.63584 -1.251933 -3.511421
H  -0.303559 2.079334 -0.848899
H  -3.558382 -0.342951 0.687697
H  5.051272 0.683027 -0.754994
H  3.092702 1.619515 3.007134
H  5.161315 1.60571 1.573691
H  -1.926699 3.866081 -1.484906
H  -5.192224 1.443115 0.046952
H  -4.384757 3.558499 -1.048083
H  -0.6447 -1.534705 -3.158384
H  -1.341551 -4.550959 1.818584
H  -2.978489 -3.929432 2.11818
H  -2.376199 -4.071675 0.43029
