program: Gaussian 09
title: 000220636
version: EM64L-G09RevD.01
frameworkgroup: C1[X(C4H6F3NO3)]
method: RPBEPBE
basis: SDD
operation: Freq
keyword: #p
keyword: freq=noraman
keyword: PBEPBE/SDD
title: #p freq=noraman PBEPBE/SDD
converged: NO YES NO NO
title: Mulliken charges:
elementType: F F F O O O N C C C C H H H H H H
charge: -0.163904 -0.149596 -0.156697 -0.419447 -0.183833 -0.208614 0.159453 -0.105768 -0.206606 0.404467 -0.676957 0.304010 0.285273 0.250904 0.240527 0.250587 0.376199
chargesum: 0.00000
title: Mulliken charges with hydrogens summed into heavy atoms:
elementType: F F F O O O N C C C C
charge: -0.163904 -0.149596 -0.156697 -0.043248 -0.183833 -0.208614 0.159453 0.198242 0.078667 0.404467 0.065062
polarizability: 6.75444256e+01 -6.45374074e-01 6.02654495e+01 5.43720234e+00 -3.27341374e+00 6.08099067e+01
1716.lowfreq: -13.8256 -0.0008 -0.0006 0.0007 4.7544 8.0487 37.4864 56.5064 72.7440
frequency: 37.3580 56.3393 72.5816 133.1339 193.4154 212.7416 227.0005 256.9557 276.1103 295.0416 324.3108 347.6021 437.6510 451.2583 513.9307 541.3941 589.8728 643.9491 677.7614 789.3200 808.2601 899.6374 995.5131 998.1585 1019.1342 1069.8033 1097.7395 1126.3416 1191.5587 1214.8291 1234.6605 1268.7716 1297.0047 1325.3184 1372.3831 1405.1840 1442.2488 1472.6297 1481.7771 3009.9311 3016.7511 3086.8351 3112.6747 3120.3793 3581.5634
redmass: 11.9808 6.2773 8.3630 7.8097 5.2288 6.1433 1.2768 4.9471 2.3946 1.7124 3.0179 7.8994 10.7566 7.5951 9.4433 4.4354 8.6516 9.3042 5.0848 7.8247 4.3782 1.8198 3.4582 5.2244 7.7244 2.4978 2.0262 1.9413 4.4212 2.7376 1.7953 1.6126 1.4811 1.4447 1.4997 1.2148 4.6061 1.0660 1.0477 1.0359 1.0834 1.0877 1.1004 1.0999 1.0667
irintensity: 0.5718 4.5129 1.0506 7.8456 4.0027 0.3943 2.7946 4.2740 3.4958 98.6517 53.9038 14.6868 7.4489 2.4486 14.2330 5.0092 39.5472 0.5140 1.1324 2.2721 55.3792 32.1988 121.5909 52.4595 242.8295 71.6963 25.7103 4.5250 151.7041 8.7988 30.2805 29.8068 23.1457 55.2631 11.8433 15.5660 134.1834 8.0340 12.4473 5.8171 8.4407 1.5536 8.0367 6.8731 28.9843
temp: 298.150 k
press: 1.00000 atm
elementType: 9 9 9 8 8 8 7 6 6 6 6 1 1 1 1 1 1
symmnumber: 1
zpe: 291451.1 jmol-1
zpe.correction: 0.111008 hartree
zpe.thermalcorrener: 0.122608 hartree
zpe.thermalcorrenthalpy: 0.123552 hartree
zpe.thermalcorrgfe: 0.072594 hartree
zpe.sumelectzpe: -735.010243 hartree
zpe.sumelectthermal: -734.998643 hartree
zpe.sumelectthermalent: -734.997699 hartree
zpe.sumelectthermalfe: -735.048657 hartree
dipole: 1.6828 0.8326 0.7379
dipole: 2.0173
quadrupole: -79.5051 -56.1265 -65.4300
quadrupole: -6.1057 1.1165 -2.2480
quadrupole: -12.4846 10.8940 1.5905 -6.1057 1.1165 -2.2480
hfenergy: -735.1212506 hartree
pointgroup: C01 [X(C4H6F3N1O3)]
dipole: -0.6548618 -0.3827672 0.2335168 debye
dipolederiv: -0.7024635 0.2613477 0.1359776 0.2178956 -0.5371945 -0.1236038 0.0927902 -0.1214378 -0.3398261 -0.4254886 -0.0310517 -0.1400969 -0.0169556 -0.2914563 -0.0940562 -0.0726601 -0.0797992 -0.7478998 -0.417072 -0.1726846 0.0751473 -0.0504275 -0.7106416 0.2160125 0.0167224 0.2206208 -0.3976958 -0.4870635 -0.0095295 -0.1700761 -0.0066215 -0.7822315 0.0527724 -0.1715572 0.0638661 -0.244201 -0.6394258 -0.0804868 0.2692165 -0.099798 -0.2068237 0.0071162 0.0856713 -0.0392001 -0.5972789 -0.5270938 -0.0862524 -0.087783 -0.0327625 -0.2354475 -0.0762911 0.1269921 -0.0781181 -0.7580151 1.0024628 0.2437681 -0.1255694 0.2214038 0.1299374 0.0808295 -0.138403 0.1243604 1.1497559 0.1211934 -0.0314018 -0.0196511 -0.1468781 0.1793017 -0.0167098 -0.0234989 -0.0507273 0.0806891 0.1277284 -0.0340611 0.0325272 -0.0485827 0.5417185 -0.0575975 -0.0300254 -0.0761573 0.1120841 1.4844663 -0.1297654 -0.06075 -0.0731859 1.3811112 -0.004054 -0.0165418 -0.0097849 1.4302771 -0.0773572 0.0051745 -0.023491 0.040143 -0.0189496 0.0039867 -0.037504 -0.024614 0.043964 0.0284339 -0.0171657 0.0090156 -0.0025621 0.0594437 0.0386264 -0.0140126 0.0317724 0.0226628 0.1188341 -0.0140687 -0.0301283 -0.0151981 0.0013901 0.0270948 0.0259116 0.0528995 -0.0350676 -0.001831 -0.062535 -0.0764976 -0.0788131 0.0664532 -0.0139108 -0.06911 0.0003268 0.0821852 0.1189636 -0.0103817 0.0016662 -0.003314 0.0575085 -0.0092849 0.0005435 0.0622045 -0.0770238 -0.0182103 0.0908334 0.0814056 0.0448754 0.0526176 -0.0077432 0.0809884 -0.0327371 0.071491 0.2939231 0.0782607 0.1290875 0.0507815 0.3132627 -0.0231872 0.1436933 -0.0434744 0.2038988 unknown
polarizability: 67.4456182|0.4610313|59.1613338|-5.5516167|2.8962501|62.0128298 unknown
InChI: InChI=1S/C4H6F3NO3/c1-2(8(10)11)3(9)4(5,6)7/h2-3,9H,1H3
charge 0 multiplicity 1
17 atoms
F  -2.706894 0.842769 0.54017
F  -2.020675 -0.328657 -1.279146
F  -2.035905 -1.311232 0.769758
O  -0.192063 1.782314 -0.084642
O  3.052946 0.236359 -0.756239
O  2.25084 0.309882 1.377676
N  2.121131 0.114467 0.113398
C  0.747923 -0.378931 -0.404965
C  -0.327278 0.406217 0.367421
C  -1.757495 -0.101848 0.086073
C  0.717967 -1.911409 -0.255991
H  0.727616 -0.076133 -1.464217
H  -0.151223 0.298749 1.456336
H  -0.185613 -2.322959 -0.733303
H  0.726853 -2.216147 0.804017
H  1.596644 -2.346463 -0.760798
H  -0.667574 2.398322 0.527751
