program: Gaussian 09
title: 000220632
version: EM64L-G09RevD.01
frameworkgroup: C1[X(C3H4BrF3O)]
method: RPBEPBE
basis: SDD
operation: Freq
keyword: #p
keyword: freq=noraman
keyword: PBEPBE/SDD
title: #p freq=noraman PBEPBE/SDD
converged: YES YES NO NO
title: Mulliken charges:
elementType: Br F F F O C C C H H H H
charge: 0.044897 -0.137060 -0.165621 -0.173270 -0.392046 -0.132422 0.413789 -0.713397 0.294489 0.310349 0.291466 0.358826
chargesum: 0.00000
title: Mulliken charges with hydrogens summed into heavy atoms:
elementType: Br F F F O C C C
charge: 0.044897 -0.137060 -0.165621 -0.173270 -0.033220 0.162067 0.413789 -0.111582
polarizability: 6.91716639e+01 -2.87868405e+00 4.27168143e+01 2.93315931e+00 -4.00648940e-01 3.97497866e+01
1716.lowfreq: -4.5707 -2.6422 0.0006 0.0008 0.0012 6.2020 58.7271 67.8900 133.1803
frequency: 58.6790 67.8516 133.1791 177.0939 217.1380 287.0285 319.1392 361.6402 429.6138 489.0809 510.7163 585.7729 662.8024 764.3665 840.6423 955.8825 1010.3087 1049.5142 1078.8410 1116.9641 1175.6580 1244.4427 1294.5977 1319.5419 1382.8092 1447.3787 3055.2980 3087.1735 3142.3869 3545.2413
redmass: 10.4161 3.9059 7.6950 17.5687 4.3397 8.1320 1.3266 6.3551 5.7514 13.1326 4.0500 9.0617 7.2584 5.4278 1.9992 2.1518 7.3521 7.5253 4.3615 1.1775 5.6524 1.1992 1.4769 1.3488 1.1537 1.0984 1.0585 1.0855 1.1085 1.0662
irintensity: 0.4495 5.9320 3.7733 0.5265 13.3875 5.6947 111.6223 32.5054 5.4867 2.2698 28.5728 54.9025 13.4550 28.4405 15.6014 74.0627 164.7383 186.0946 52.2582 54.3192 148.9372 26.3146 27.1019 30.1629 11.7850 10.6664 7.2966 3.7584 2.0520 17.0036
temp: 298.150 k
press: 1.00000 atm
elementType: 35 9 9 9 8 6 6 6 1 1 1 1
symmnumber: 1
zpe: 190270.7 jmol-1
zpe.correction: 0.072470 hartree
zpe.thermalcorrener: 0.081316 hartree
zpe.thermalcorrenthalpy: 0.082261 hartree
zpe.thermalcorrgfe: 0.036742 hartree
zpe.sumelectzpe: -504.275397 hartree
zpe.sumelectthermal: -504.266551 hartree
zpe.sumelectthermalent: -504.265607 hartree
zpe.sumelectthermalfe: -504.311125 hartree
dipole: -0.6520 -0.8505 1.2263
dipole: 1.6286
quadrupole: -64.1690 -57.4052 -52.2780
quadrupole: 0.6088 0.2890 2.9621
quadrupole: -6.2182 0.5455 5.6727 0.6088 0.2890 2.9621
hfenergy: -504.3478676 hartree
pointgroup: C01 [X(C3H4Br1F3O1)]
dipole: -0.2518209 -0.3851953 0.4458094 debye
dipolederiv: -0.4056879 -0.0118949 -0.0024096 0.0266121 -0.0862615 0.0128252 -0.0409703 0.0159106 -0.1002743 -0.7425258 -0.2465119 0.1986538 -0.1944464 -0.4477825 0.1450899 0.1717141 0.1531974 -0.3977527 -0.4431332 0.174986 0.0521364 0.0686354 -0.8078219 -0.1775032 0.0066786 -0.1372181 -0.3330289 -0.4542576 0.0126901 -0.1478332 0.0270637 -0.2973591 -0.0154707 -0.0902541 -0.0338944 -0.7975506 -0.6038087 -0.0216084 0.0514118 -0.0770132 -0.6662246 -0.1807052 0.0267003 -0.2233033 -0.1810355 0.0989377 -0.0212969 -0.0506191 0.1953653 0.5344526 0.1702838 -0.1225848 0.1707952 0.1599641 1.5339265 0.0944932 -0.0685526 -0.0201234 1.3976326 0.0101487 -0.0547713 0.0185835 1.470691 0.5823516 -0.0869711 0.1173151 -0.103892 -0.0734462 -0.0345973 0.1312689 0.0197122 0.0920085 0.0914737 0.018262 -0.0168838 0.0029089 0.0599331 0.0030674 0.0183875 -0.0311622 -0.0216969 -0.0149308 0.0628173 -0.0099474 0.0258279 -0.0191991 -0.0312399 -0.0111799 -0.0321187 0.098143 -0.0419029 0.0055229 -0.0919827 0.0057207 0.0995725 -0.0190453 -0.0317507 0.0123389 -0.0556293 0.3995575 0.0195116 -0.0312887 0.0433412 0.3065041 0.1171466 -0.0032383 0.0671589 0.0661616 unknown
polarizability: 69.2098534|-1.7168436|42.5109139|3.6808912|-0.0746244|39.9174975 unknown
InChI: InChI=1S/C3H4BrF3O/c4-1-2(8)3(5,6)7/h2,8H,1H2
charge 0 multiplicity 1
12 atoms
Br -3.271969 -0.291437 -0.182227
F  1.996872 0.660423 -0.710871
F  1.299402 -1.479294 -0.454383
F  1.355668 -0.073784 1.339778
O  -0.595254 1.658784 0.121484
C  -0.401484 0.293548 -0.325419
C  1.060551 -0.141096 -0.050962
C  -1.368674 -0.729389 0.297495
H  -0.53376 0.331256 -1.419147
H  -1.19036 -1.742987 -0.089998
H  -1.323635 -0.730265 1.398542
H  -0.581554 1.700139 1.113107
