program: Gaussian 09
title: 000220630
version: EM64L-G09RevD.01
frameworkgroup: C1[X(C13H11ClN4O)]
method: RPBEPBE
basis: SDD
operation: Freq
keyword: #p
keyword: freq=noraman
keyword: PBEPBE/SDD
title: #p freq=noraman PBEPBE/SDD
converged: YES YES NO NO
title: Mulliken charges:
elementType: Cl O N N N N C C C C C C C C C C C C C H H H H H H H H H H H
charge: -0.047988 -0.340542 -0.149327 -0.382236 -0.648937 -0.016606 0.513525 -0.374724 -0.384790 -0.323348 -0.217339 -0.222477 -0.112114 -0.193229 -0.132495 -0.363765 0.134325 0.314168 -0.071216 0.233839 0.237718 0.230046 0.257278 0.257971 0.225897 0.259270 0.261312 0.334860 0.411109 0.309815
chargesum: 0.00000
title: Mulliken charges with hydrogens summed into heavy atoms:
elementType: Cl O N N N N C C C C C C C C C C C C C
charge: -0.047988 -0.340542 -0.149327 -0.047376 0.071988 -0.016606 0.513525 -0.140885 -0.147071 -0.093303 0.039939 0.035493 -0.112114 0.032668 0.126775 -0.102453 0.134325 0.314168 -0.071216
polarizability: 5.47380710e+02 -1.15659541e+00 1.88964363e+02 1.39369947e-01 9.10823759e-02 6.98753492e+01
1716.lowfreq: -1.9634 -0.0022 -0.0017 0.0011 2.8504 8.1163 25.1214 27.6619 31.7223
frequency: 25.0973 27.5950 31.2433 55.2904 80.4443 83.6061 104.6978 120.5210 137.1860 184.8703 187.2695 228.5848 251.8534 276.2157 288.6885 335.7593 358.2907 359.3649 372.4493 375.0862 411.4019 430.8328 486.7021 497.9185 510.0149 513.2642 542.2367 600.6969 626.5261 668.8236 672.5912 710.2357 723.3500 773.0423 821.9051 826.0644 834.3291 865.0657 876.3386 893.9646 919.2188 947.5622 964.4963 967.0848 972.5934 996.2404 1024.3848 1061.3120 1073.8563 1109.4619 1139.4637 1173.7824 1187.6577 1200.6532 1234.8547 1273.6851 1284.8402 1294.5799 1315.5136 1335.1071 1348.3850 1384.0756 1406.7418 1426.2420 1478.8930 1480.5404 1536.6707 1569.4385 1590.6370 1609.3597 1624.1782 1640.6003 2220.7102 3089.8077 3098.3550 3111.1413 3133.5337 3146.2904 3152.3284 3160.3040 3171.6297 3174.7039 3530.3223 3597.9449
redmass: 5.7877 8.9220 4.8028 6.6984 9.1220 5.9544 4.3494 8.6010 3.6396 9.6711 3.7356 6.9249 3.0583 3.2584 5.4124 8.2100 1.3526 4.7241 3.5658 11.3122 2.9136 4.3199 4.5948 4.2995 2.5987 5.1016 1.4122 8.4973 7.0927 6.0976 6.5543 3.6394 4.0767 6.0203 1.3431 1.4041 4.6931 6.7544 1.7875 1.1672 1.8942 1.2916 1.3084 1.3764 4.0851 4.0361 1.1081 2.1893 2.8254 1.4379 2.7134 2.5148 1.1252 1.2938 2.2864 1.8253 1.7942 1.3588 1.4256 2.1151 3.2441 3.5407 3.3026 2.4807 2.5703 3.1181 2.2839 7.0006 5.0965 3.8274 3.6546 4.0838 12.4302 1.0913 1.0910 1.0885 1.0898 1.0884 1.0911 1.0672 1.0955 1.0966 1.0766 1.0873
irintensity: 2.4398 1.1507 1.7999 9.7268 5.0008 2.3309 2.4051 1.0720 1.2172 3.9982 6.3119 0.3270 0.1666 10.6778 6.3936 12.2979 0.3241 7.5350 1.8419 24.7637 0.1548 4.8369 20.3640 2.1951 15.5102 1.9351 260.2564 24.7405 0.9852 15.3131 1.6442 0.0970 1.4044 13.4356 21.3837 33.4099 3.3345 42.8621 5.5970 162.8124 4.2014 7.7633 1.3248 0.6028 48.9670 52.4445 100.6033 91.2810 91.2166 8.3212 26.2169 72.5309 5.2385 3.8380 31.1867 247.1894 20.2419 2.4338 39.9970 21.5438 493.3298 72.0285 19.0616 584.5079 139.8999 1017.6258 226.4336 11.2997 404.7477 673.2434 496.1823 88.5569 127.4731 6.2219 2.7382 25.5198 9.7432 4.8021 21.3436 252.1679 7.2760 3.9268 59.1573 84.1920
temp: 298.150 k
press: 1.00000 atm
elementType: 17 8 7 7 7 7 6 6 6 6 6 6 6 6 6 6 6 6 6 1 1 1 1 1 1 1 1 1 1 1
symmnumber: 1
zpe: 570191.7 jmol-1
zpe.correction: 0.217175 hartree
zpe.thermalcorrener: 0.235394 hartree
zpe.thermalcorrenthalpy: 0.236338 hartree
zpe.thermalcorrgfe: 0.167854 hartree
zpe.sumelectzpe: -1254.907053 hartree
zpe.sumelectthermal: -1254.888834 hartree
zpe.sumelectthermalent: -1254.887889 hartree
zpe.sumelectthermalfe: -1254.956374 hartree
dipole: 3.3880 -4.1702 0.0278
dipole: 5.3731
quadrupole: -79.7552 -123.2991 -123.0345
quadrupole: -22.5653 0.2632 0.0960
quadrupole: 28.9410 -14.6028 -14.3382 -22.5653 0.2632 0.0960
hfenergy: -1255.1242274 hartree
pointgroup: C01 [X(C13H11Cl1N4O1)]
dipole: 1.2762226 -1.6779672 0.1560569 debye
polarizability: 546.5862776|-12.3776154|188.8788284|13.0083805|-8.2321286|70.755317 unknown
InChI: InChI=1S/C13H11ClN4O/c14-11-7-5-10(6-8-11)3-1-2-4-12(19)18-13(16)17-9-15/h1-8,17H,16H2
charge 0 multiplicity 1
30 atoms
Cl -7.911635 1.135127 -0.215309
O  2.909879 -2.102929 0.273045
N  3.921494 0.063094 0.14883
N  6.225245 0.490067 0.181331
N  5.492256 -1.756449 0.323735
N  5.926657 3.019096 -0.00741
C  -3.511525 -0.364004 -0.013261
C  -3.811079 1.028975 -0.106983
C  -4.604356 -1.280037 0.016142
C  -2.14564 -0.891251 0.053887
C  -5.140177 1.486815 -0.168282
C  -5.941193 -0.838426 -0.044347
C  -6.190764 0.54471 -0.135963
C  -0.970492 -0.171279 0.039866
C  0.330127 -0.798337 0.11308
C  1.524935 -0.115643 0.100621
C  2.81825 -0.810919 0.181073
C  5.155164 -0.434415 0.218179
C  6.031599 1.830258 0.08025
H  -3.001649 1.76567 -0.13267
H  -4.401305 -2.355156 0.087756
H  -2.063105 -1.986456 0.122896
H  -5.361066 2.555653 -0.240149
H  -6.77004 -1.551367 -0.020855
H  -0.991661 0.925323 -0.028109
H  0.377172 -1.895301 0.184128
H  1.571061 0.976619 0.030834
H  7.187514 0.147407 0.230972
H  4.657224 -2.382999 0.344762
H  6.450409 -2.09905 0.376651
