program: Gaussian 09
title: 000220603
version: EM64L-G09RevD.01
frameworkgroup: C1[X(C17H20N4O)]
method: RPBEPBE
basis: SDD
operation: Freq
keyword: #p
keyword: freq=noraman
keyword: PBEPBE/SDD
title: #p freq=noraman PBEPBE/SDD
converged: YES YES NO NO
title: Mulliken charges:
elementType: O N N N N C C C C C C C C C C C C C C C C C H H H H H H H H H H H H H H H H H H H H
charge: -0.180725 -0.000020 -0.004221 -0.000022 -0.004228 0.386117 0.386118 -0.588425 -0.588409 -0.021609 -0.509199 -0.512512 -0.509166 -0.512509 -0.446658 -0.449761 -0.446676 -0.449771 -0.162463 -0.166200 -0.162468 -0.166199 0.236148 0.243232 0.236147 0.243230 0.261744 0.237065 0.244465 0.247557 0.261730 0.237061 0.244469 0.247558 0.257966 0.266282 0.255325 0.304721 0.257968 0.266281 0.255316 0.304742
chargesum: 0.00000
title: Mulliken charges with hydrogens summed into heavy atoms:
elementType: O N N N N C C C C C C C C C C C C C C C C C
charge: -0.180725 -0.000020 -0.004221 -0.000022 -0.004228 0.386117 0.386118 -0.109045 -0.109032 -0.021609 -0.010391 -0.020490 -0.010375 -0.020482 0.077589 0.110285 0.077574 0.110287 -0.162463 -0.166200 -0.162468 -0.166199
polarizability: 2.12223508e+02 -7.68102483e+00 2.19411874e+02 1.50343666e-03 -1.15924645e-02 1.48520737e+02
1716.lowfreq: -10.7071 -6.4370 -0.0002 0.0007 0.0008 10.1250 16.9962 31.8001 40.4083
frequency: 15.3539 31.8001 40.4006 40.6825 48.1431 63.6634 76.1227 100.5626 102.5158 110.8056 123.1301 129.0831 149.3444 158.9226 179.7598 192.4821 226.9810 231.5428 233.9440 260.3516 267.7080 306.3886 342.4695 353.9692 367.8913 368.1966 373.8433 374.3335 401.9895 403.6789 480.4291 482.0761 512.3538 534.5057 588.4005 608.6586 618.4520 695.1822 736.2556 748.2692 751.4409 776.4766 779.4003 801.7604 877.0275 885.4549 911.4821 936.1483 940.4326 942.5603 943.0070 949.3363 974.0852 1000.2480 1006.7556 1023.8943 1027.4470 1039.9612 1040.1697 1065.7721 1068.5969 1114.8995 1117.2610 1135.8542 1156.0417 1177.2587 1183.3517 1209.8004 1218.7050 1226.2035 1236.1475 1277.4415 1279.7977 1279.9926 1285.7938 1292.5713 1293.0860 1298.4779 1302.3539 1317.1464 1326.7815 1347.6871 1348.4799 1352.0462 1354.5223 1452.2485 1452.5043 1457.9149 1458.4449 1471.1452 1475.3413 1479.7740 1480.1523 1486.6061 1488.0954 1625.6795 2201.0931 2201.1647 2202.8080 2202.8873 2988.3199 2988.4931 2992.1438 2992.2019 2995.4602 2997.7043 3003.5429 3003.8365 3005.4804 3005.7212 3036.9364 3037.2118 3042.3806 3042.3996 3056.3579 3064.1989 3064.2643 3067.4229 3069.5575 3070.3948
redmass: 9.9163 11.5604 9.4233 9.2103 7.3834 3.9379 4.7728 7.1286 3.1814 3.1419 2.8390 4.1551 2.9322 6.0118 6.3626 3.5450 2.8039 2.9906 5.1116 4.4860 2.5210 6.2923 3.0994 2.2493 3.5466 3.7527 3.5009 3.6485 3.8203 2.8291 5.9947 6.4982 5.3063 5.1712 3.3239 5.4587 3.1457 2.6367 3.5699 1.3105 1.3323 1.3358 1.4664 2.6540 2.8694 2.4255 2.5006 4.5485 4.0594 3.8519 3.3375 2.5138 2.3258 2.2809 1.9933 2.7639 2.5362 3.4766 3.8500 2.6241 2.0607 2.3117 1.9505 1.7999 2.7113 1.2713 1.3959 1.3551 1.5673 1.4005 1.5129 1.2204 1.2709 1.2742 1.3239 1.3029 1.2543 1.1984 1.2012 1.2780 1.5484 1.3872 1.3758 1.4103 1.4355 1.0829 1.0834 1.0700 1.0706 1.0829 1.0830 1.0880 1.0816 1.0805 1.0863 11.8662 12.4247 12.4259 12.4394 12.4403 1.0602 1.0603 1.0596 1.0593 1.0599 1.0659 1.0600 1.0602 1.0600 1.0600 1.1011 1.1009 1.0991 1.0992 1.0994 1.1019 1.1020 1.1032 1.1022 1.1026
irintensity: 0.9668 0.4561 3.0756 10.4466 9.4327 6.7472 1.0655 5.5810 5.3127 2.3801 0.3162 1.6560 7.5868 1.1979 2.9520 2.5912 0.0963 0.3882 1.2309 4.4373 0.3807 7.9253 1.1742 1.6452 0.3824 0.0310 0.0026 1.2833 2.4754 0.6025 0.1344 8.5593 2.5746 3.9083 7.0281 0.3280 4.0436 0.1592 2.6221 7.8921 3.3055 27.8521 0.3092 6.2119 0.3037 16.5340 0.0009 3.6660 0.0926 0.0529 0.5415 4.8488 1.5945 62.0417 0.9094 1.9689 15.0543 1.9445 9.1965 0.8165 3.9627 5.4937 0.3735 39.4326 0.0353 7.5336 4.0067 0.8618 33.3356 1.6758 4.4568 4.7450 0.6004 4.9497 17.5567 1.9505 0.6491 1.2413 0.9490 1.5630 2.7310 1.7918 9.1900 8.1118 0.8948 8.0477 14.1434 8.0719 2.5624 7.9069 12.6694 12.0271 9.4634 39.8132 0.0186 89.5747 26.5148 0.4243 21.4301 0.7505 1.3526 4.6434 3.0976 4.4621 29.6036 25.3562 14.0763 0.3199 14.5448 13.6609 0.4670 27.6697 0.3427 3.1629 17.5142 4.5193 28.0023 6.4425 9.3032 70.9229
temp: 298.150 k
press: 1.00000 atm
elementType: 8 7 7 7 7 6 6 6 6 6 6 6 6 6 6 6 6 6 6 6 6 6 1 1 1 1 1 1 1 1 1 1 1 1 1 1 1 1 1 1 1 1
symmnumber: 1
zpe: 882925.9 jmol-1
zpe.correction: 0.336289 hartree
zpe.thermalcorrener: 0.359718 hartree
zpe.thermalcorrenthalpy: 0.360662 hartree
zpe.thermalcorrgfe: 0.280936 hartree
zpe.sumelectzpe: -952.346790 hartree
zpe.sumelectthermal: -952.323361 hartree
zpe.sumelectthermalent: -952.322417 hartree
zpe.sumelectthermalfe: -952.402143 hartree
dipole: 0.0001 -0.0014 5.4270
dipole: 5.4270
quadrupole: -178.8973 -199.0633 -127.1150
quadrupole: 7.8026 -0.0019 0.0079
quadrupole: -10.5388 -30.7047 41.2435 7.8026 -0.0019 0.0079
hfenergy: -952.6830788 hartree
pointgroup: C01 [X(C17H20N4O1)]
dipole: -0.0000375 0.0005438 2.135146 debye
polarizability: 211.7318709|-7.4311755|219.9035113|-0.0011257|0.0116352|148.5207366 unknown
InChI: InChI=1S/C17H20N4O/c18-11-1-5-16(6-2-12-19)9-10-17(15(16)22,7-3-13-20)8-4-14-21/h1-10H2
charge 0 multiplicity 1
42 atoms
O  -0.00005 -0.000102 -1.636454
N  5.195205 -3.084081 -0.061603
N  3.179131 4.450304 -0.912079
N  -5.196266 3.083199 -0.060892
N  -3.177687 -4.450467 -0.912745
C  1.28113 0.005632 0.493435
C  -1.281192 -0.005376 0.493454
C  0.726815 -0.277096 1.922443
C  -0.726892 0.277291 1.922471
C  -0.000041 0.000415 -0.378762
C  2.274435 -1.070623 -0.02338
C  1.877837 1.458709 0.442917
C  -2.27485 1.070654 -0.023147
C  -1.87744 -1.458634 0.442717
C  3.61096 -1.108086 0.770637
C  2.419004 1.895668 -0.948453
C  -3.611356 1.10756 0.770927
C  -2.418396 -1.895577 -0.948741
C  4.491869 -2.197179 0.315165
C  2.841608 3.306129 -0.938703
C  -4.492621 2.196462 0.315684
C  -2.840532 -3.30618 -0.939211
H  0.719603 -1.367516 2.113508
H  1.339575 0.189617 2.713389
H  -0.719699 1.367699 2.113602
H  -1.339636 -0.18949 2.713389
H  2.47934 -0.90827 -1.096785
H  1.794084 -2.064664 0.051122
H  2.690595 1.528371 1.19066
H  1.106855 2.183483 0.766353
H  -2.479742 0.908417 -1.096573
H  -1.794809 2.064833 0.051503
H  -2.690211 -1.528661 1.190413
H  -1.106242 -2.183207 0.766089
H  4.160921 -0.153828 0.665107
H  3.413841 -1.247448 1.850954
H  3.284707 1.276439 -1.25005
H  1.646007 1.751643 -1.726024
H  -4.161025 0.153151 0.665249
H  -3.414238 1.246791 1.851261
H  -3.28429 -1.276595 -1.250294
H  -1.645408 -1.751188 -1.726254
